Taxon Name and Rank Vocabulary
type: Ontology
type: Vocabulary
preferred namespace prefix: txn_nomen
preferred namespace uri: http://lod.taxonconcept.org/ontology/taxnomen/index.owl#
description: This is an ontology for labeling and linking data sets consisting of taxonomic names and ranks. It attempts to link together related vocabularies where appropriate.
issued: 2011-12-13
modified: 2012-02-29
version info: 0.37
comment: Version 0.36 A early beta version. Recently updated to follow Mondeca Recommendations in vocabulary design. Added Parvclass and Magnorder
creator: Peter J DeVries
publisher: TaxonConcept Knowledge Base Project

yearDescribed
type: ObjectProperty
comment: The year that the species was originally described
domain: Taxon
range: Year
term status: testing

yearBorn
type: ObjectProperty
comment: The year that a person was born
domain: Person
range: Year
term status: testing

yearDied
type: ObjectProperty
comment: The year that a person was born
domain: Person
range: Year
term status: testing

yearPub
type: ObjectProperty
comment: The year that document was pub
domain: Document
range: Year
term status: testing

pubYearOf
type: ObjectProperty
comment: The year that document was pub
inverse of: yearPub
domain: Year
range: Document
term status: testing

original First Author
type: ObjectProperty
comment: The URI to the original first author of the description
domain: Taxon
range: Taxonomist
term status: testing

original First Author Of
type: ObjectProperty
comment: The URI to the original first author of the description
domain: Taxonomist
range: Taxon
term status: testing

relatedName
type: ObjectProperty
comment: The URI to the Orthochresonym Name String
domain: TaxonNameID
range: TaxonNameID
term status: testing

relatedNameOf
type: ObjectProperty
comment: The URI to the Orthochresonym Name String
domain: TaxonNameID
range: TaxonNameID
inverse of: relatedName
term status: testing

taxon Name
type: ObjectProperty
comment: links to the string form of a taxon name
domain: Taxon
range: TaxonName
term status: testing

accepted Scientific Name
type: ObjectProperty
comment: links to the string form of an accepted scientific taxon name
sub property of: scientific name
domain: Taxon
range: ScientificName
term status: testing

alt Scientific Name
type: ObjectProperty
comment: links to the string form of an alternative accepted scientific taxon name
sub property of: scientific name
domain: Taxon
range: ScientificName
term status: testing

scientific name
type: ObjectProperty
comment: Links to the the string form of a ScientificName
domain: Taxon
range: TaxonName
sub property of: taxon Name
term status: testing

Scientific name with Author
type: ObjectProperty
comment: Links to the the string form of a taxon name with an authority string
domain: Taxon
range: TaxonName
sub property of: taxon Name
term status: testing

Scientific Authority (Author)
type: ObjectProperty
comment: Links to the the string form of a taxonomic authority
domain: Taxon
range: Authorship String
term status: testing

accepted Scientific Name with authorship
type: ObjectProperty
comment: links to the string form of an accepted scientific taxon name with the authorship string
sub property of: Scientific name with Author
domain: Taxon
range: TaxonName
term status: testing

accepted Scientific Name with authorship
type: ObjectProperty
comment: inks to the string form of an alternative scientific taxon name with the authorship string
sub property of: Scientific name with Author
domain: Taxon
range: TaxonName
term status: testing

original Scientific Name
type: ObjectProperty
comment: links to the string form of an original scientific Taxon name (basionym)
sub property of: scientific name
domain: Taxon
range: ScientificName
term status: testing

original Scientific Name with authorship
type: ObjectProperty
comment: links to the string form of an original Taxon name (basionym) with authorship
sub property of: Scientific name with Author
domain: Taxon
range: TaxonName
term status: testing

Common Name
type: ObjectProperty
comment: Links to the the string form of a common name
sub property of: taxon Name
domain: Taxon
range: TaxonName
term status: testing

Synonym Name
type: ObjectProperty
comment: Links to the the string form of a synonym name
domain: Taxon
range: ScientificName
sub property of: scientific name
term status: testing

Synonym Name Author
type: ObjectProperty
comment: Links to the the string form of a synonym name
domain: Taxon
range: ScientificName
sub property of: Scientific name with Author
term status: testing

taxonNameID
type: ObjectProperty
comment: links to the URI form of a Taxon name
domain: Taxon
range: TaxonNameID
term status: testing

acceptedScientificNameID
type: ObjectProperty
comment: links to the URI (globalnames.org ) form of the accepted Taxon name
sub property of: taxonNameID
domain: Taxon
range: TaxonNameID
term status: testing

alternativeAcceptedNameID
type: ObjectProperty
comment: links to the URI (globalnames.org ) form of an alternative accepted Taxon name
sub property of: taxonNameID
domain: Taxon
range: TaxonNameID
term status: testing

origScientificNameID
type: ObjectProperty
comment: links to the URI (globalnames.org ) form of the accepted Taxon name
sub property of: taxonNameID
domain: Taxon
range: TaxonNameID
term status: testing

synonym name ID
type: ObjectProperty
comment: links to the URI (globalnames.org ) form of synonym Taxon name
sub property of: taxonNameID
domain: Taxon
range: TaxonNameID
term status: testing

narrowerRank
type: ObjectProperty
sub property of: narrower
range: TaxonRank
domain: TaxonRank
term status: testing

broaderRank
type: ObjectProperty
sub property of: broader
range: TaxonRank
domain: TaxonRank
term status: testing

narrowerTaxon
type: ObjectProperty
sub property of: narrower
range: Taxon
domain: Taxon
term status: testing

broaderTaxon
type: ObjectProperty
sub property of: broader
range: Taxon
domain: Taxon
term status: testing

taxonRank
type: ObjectProperty
comment: Links to the string form of a Taxonomic Rank as a URI
domain: Taxon
range: TaxonRank
term status: testing

inKingdom
type: ObjectProperty
comment: Links to the URI for a Biological Kingdom
term status: testing

inPhylum
type: ObjectProperty
comment: Links to the URI for a Biological Phylum
term status: testing

inClass
type: ObjectProperty
comment: Links to the URI for a Biological Class
term status: testing

inSubclass
type: ObjectProperty
comment: Links to the URI for a Biological Subclass
term status: testing

inInfraclass
type: ObjectProperty
comment: Links to the URI for a Biological Infraclass
term status: testing

inSuperorder
type: ObjectProperty
comment: Links to the URI for a Biological Superorder
term status: testing

inOrder
type: ObjectProperty
comment: Links to the URI for a Biological Order
term status: testing

inSuborder
type: ObjectProperty
comment: Links to the URI for a Biological Suborder
term status: testing

inSuperfamily
type: ObjectProperty
comment: Links to the URI for a Biological Superfamily
term status: testing

inFamily
type: ObjectProperty
comment: Links to the URI for a Biological Family
term status: testing

inSubfamily
type: ObjectProperty
comment: Links to the URI for a Subfamily
term status: testing

inTribe
type: ObjectProperty
comment: Links to the URI for a Tribe
term status: testing

inGenus
type: ObjectProperty
comment: Links to the URI for a Genus
equivalent property: inGenus
term status: testing

Domain Name
type: ObjectProperty
comment: Links to the the string form of a Subdomain Name
sub property of: scientific name
range: TaxonName
term status: testing

Subdomain Name
type: ObjectProperty
comment: Links to the the string form of a Subdomain Name
sub property of: scientific name
range: TaxonName
term status: testing

superkingdom name
type: ObjectProperty
comment: Links to the the string form of a superkingdomName
sub property of: scientific name
range: TaxonName
term status: testing

kingdom name
type: ObjectProperty
comment: Links to the the string form of a kingdomName
sub property of: scientific name
range: TaxonName
term status: testing

subkingdom name
type: ObjectProperty
comment: Links to the the string form of a subkingdomName
sub property of: scientific name
range: TaxonName
term status: testing

superphylum name
type: ObjectProperty
comment: Used to specify the name of a phylum as part of a Taxon Name
sub property of: scientific name
range: TaxonName
term status: testing

phylum name
type: ObjectProperty
comment: Links to the the string form of a phylum or division name
sub property of: scientific name
range: TaxonName
term status: testing

subphylum name
type: ObjectProperty
comment: Links to the the string form of subphylumName
sub property of: scientific name
range: TaxonName
term status: testing

class name
type: ObjectProperty
comment: Links to the the string form of className
sub property of: scientific name
range: TaxonName
term status: testing

subclass name
type: ObjectProperty
comment: Links to the the string form of subclassName
sub property of: scientific name
range: TaxonName
term status: testing

infraclass name
type: ObjectProperty
comment: Links to the the string form of infraclassName
sub property of: scientific name
range: TaxonName
term status: testing

superorder name
type: ObjectProperty
comment: Links to the the string form of superorderName
sub property of: scientific name
range: TaxonName
term status: testing

order name
type: ObjectProperty
comment: Links to the the string form of orderName
sub property of: scientific name
range: TaxonName
term status: testing

suborder name
type: ObjectProperty
comment: Links to the the string form of suborderName
sub property of: scientific name
range: TaxonName
term status: testing

infraorder name
type: ObjectProperty
comment: Links to the the string form of infraorderName
sub property of: scientific name
range: TaxonName
term status: testing

parvorder name
type: ObjectProperty
comment: Links to the the string form of parvorderName
sub property of: scientific name
range: TaxonName
term status: testing

superfamily name
type: ObjectProperty
comment: Links to the the string form of superfamilyName
sub property of: scientific name
range: TaxonName
term status: testing

family name
type: ObjectProperty
comment: Links to the the string form of familyName
sub property of: scientific name
range: TaxonName
term status: testing

subfamily name
type: ObjectProperty
comment: Links to the the string form of subfamilyName
sub property of: scientific name
range: TaxonName
term status: testing

tribe name
type: ObjectProperty
comment: Links to the the string form of tribeName
sub property of: scientific name
range: TaxonName
term status: testing

genus name
type: ObjectProperty
comment: Links to the the string form of genusName
sub property of: scientific name
domain: Taxon
range: TaxonName
term status: testing

subgenus name
type: ObjectProperty
comment: Links to the the string form of subgenusName
sub property of: scientific name
domain: Taxon
range: TaxonName
term status: testing

species name
type: ObjectProperty
comment: Links to the the string form of species or epithet name
sub property of: scientific name
domain: Taxon
range: TaxonName
term status: testing

subspecies name
type: ObjectProperty
comment: Links to the the string form of subspecies or subspecific epithet name
domain: Taxon
range: TaxonName
sub property of: scientific name
term status: testing

binomial
type: ObjectProperty
comment: Links to the the string form of the binomial name
domain: Taxon
range: TaxonName
sub property of: scientific name
term status: testing

trinomial
type: ObjectProperty
comment: Links to the the string form of the trinomial name
domain: Taxon
range: TaxonName
sub property of: scientific name
term status: testing

TaxonName
type: Class
comment: A name of a taxon
term status: testing

ScientificName
type: Class
comment: The scientific name of a taxon without the authorship string e.g. "Puma concolor", "Felidae"
subclass of: TaxonName
term status: testing

ScientificNameWithAuthorship
type: Class
comment: The scientific name of a taxon with the authorship string e.g. "Puma concolor (Linnaeus 1771)", "Mammalia Linnaeus, 1758"
subclass of: TaxonName
term status: testing

SurrogateName
type: Class
comment: The surrogate name of a taxon e.g. "Aedes sp 2495"
subclass of: TaxonName
term status: testing

CommonName
type: Class
comment: The common or vernacular name for a Taxon e.g. "Mountain Lion"@en
subclass of: TaxonName
term status: testing

TaxonRank
type: Class
comment: A rank of a taxon
term status: testing

Taxon
type: Class
comment: The class for a taxon as opposed to a taxon name
subclass of: Thing
term status: testing

TaxonNameID
type: Class
comment: The URI for a given taxon name, typically a globalnames.org URI
subclass of: Thing

ScientificNameID
type: Class
comment: The URI for a given scientific name, typically a globalnames.org URI
subclass of: TaxonNameID
label: ScientificNameWithAuthorID

SurrogateNameID
type: Class
comment: The URI for a given surrogate name, typically a globalnames.org URI
subclass of: TaxonNameID

CommonNameID
type: Class
comment: The URI for a given common or vernacular name, typically a globalnames.org URI
subclass of: TaxonNameID

Authorship String
type: Class
comment: The Authority String or Authorship string i.e. (L. 1785)
subclass of: TaxonNameID

Authorship String ID
type: Class
comment: The URI version of an authority string or authorship string i.e. (L. 1785)
subclass of: Thing

Year
type: Class
comment: Class for the Concept Year
subclass of: Year

Taxonomist
type: Class
comment: Class for a Taxonomist a dbpedia_owl:Scientist and foaf:Person
subclass of: Scientist
term status: testing

Rank Class
type: Class
type: NamedIndividual
subclass of: TaxonRank
narrowerRank: Subclass
broaderRank: Superclass
term status: testing

Rank Family
type: Class
type: NamedIndividual
subclass of: TaxonRank
narrowerRank: Subfamily
broaderRank: Superfamily
term status: testing

Rank Forma
type: Class
type: NamedIndividual
subclass of: TaxonRank
broaderRank: Varietas
term status: testing

Rank Genus
type: Class
type: NamedIndividual
subclass of: TaxonRank
narrowerRank: Subgenus
broaderRank: Subtribe
term status: testing

Rank Infraclass
type: Class
type: NamedIndividual
subclass of: TaxonRank
narrowerRank: Subclass
broaderRank: Superorder
term status: testing

Rank Infraorder
type: Class
type: NamedIndividual
subclass of: TaxonRank
narrowerRank: Parvorder
broaderRank: Suborder
term status: testing

Rank Kingdom
type: Class
type: NamedIndividual
subclass of: TaxonRank
narrowerRank: Subkingdom
broaderRank: Superkingdom
term status: testing

Rank Species
type: Class
type: NamedIndividual
subclass of: TaxonRank
term status: testing

Rank Species
type: Class
type: NamedIndividual
subclass of: TaxonRank
narrowerRank: Subspecies
broaderRank: Subgenus
term status: testing

Rank Species Group
type: Class
type: NamedIndividual
subclass of: TaxonRank
narrowerRank: Species
term status: testing

Rank Species Subgroup
type: Class
type: NamedIndividual
subclass of: TaxonRank
broaderRank: Species
term status: testing

Rank Subclass
type: Class
type: NamedIndividual
subclass of: TaxonRank
narrowerRank: Infraclass
broaderRank: Class
term status: testing

Rank Subfamily
type: Class
type: NamedIndividual
subclass of: TaxonRank
narrowerRank: Tribe
broaderRank: Family
term status: testing

Rank Subgenus
type: Class
type: NamedIndividual
subclass of: TaxonRank
narrowerRank: Species
broaderRank: Genus
term status: testing

Rank Subkingdom
type: Class
type: NamedIndividual
subclass of: TaxonRank
narrowerRank: Superphylum
broaderRank: Kingdom
term status: testing

Rank Parvclass
type: Class
type: NamedIndividual
subclass of: TaxonRank
narrowerRank: Rank Magnorder
broaderRank: Infraclass
term status: testing

Rank Magnorder
type: Class
type: NamedIndividual
subclass of: TaxonRank
narrowerRank: Superorder
broaderRank: Parvclass
term status: testing

Rank Parvorder
type: Class
type: NamedIndividual
subclass of: TaxonRank
narrowerRank: Superfamily
broaderRank: Infraorder
term status: testing

Rank Phylum
type: Class
type: NamedIndividual
subclass of: TaxonRank
narrowerRank: Subphylum
broaderRank: Superphylum
term status: testing

Rank Suborder
type: Class
type: NamedIndividual
subclass of: TaxonRank
narrowerRank: Infraorder
broaderRank: Order
term status: testing

Rank Subphylum
type: Class
type: NamedIndividual
subclass of: TaxonRank
narrowerRank: Superorder
broaderRank: Phylum
term status: testing

Rank Subspecies
type: Class
type: NamedIndividual
subclass of: TaxonRank
broaderRank: Species
narrowerRank: Varietas
term status: testing

Rank Subtribe
type: Class
type: NamedIndividual
subclass of: TaxonRank
narrowerRank: Genus
broaderRank: Tribe
term status: testing

Rank Superclass
type: Class
type: NamedIndividual
subclass of: TaxonRank
narrowerRank: Class
broaderRank: Subphylum
term status: testing

Rank Superfamily
type: Class
type: NamedIndividual
subclass of: TaxonRank
narrowerRank: Family
broaderRank: Infraorder
term status: testing

Rank Superkingdom
type: Class
type: NamedIndividual
subclass of: TaxonRank
narrowerRank: Kingdom
term status: testing

Rank Superorder
type: Class
type: NamedIndividual
subclass of: TaxonRank
narrowerRank: Order
broaderRank: Infraclass
term status: testing

Rank Superphylum
type: Class
type: NamedIndividual
subclass of: TaxonRank
narrowerRank: Phylum
broaderRank: Subkingdom
term status: testing

Rank Tribe
type: Class
type: NamedIndividual
subclass of: TaxonRank
narrowerRank: Subtribe
broaderRank: Subfamily
term status: testing

Rank Varietas
type: Class
type: NamedIndividual
subclass of: TaxonRank
broaderRank: Subspecies
narrowerRank: Forma
term status: testing

Habitat
type: Thing
equivalent class: Habitat
term status: testing