hsapdv.owl
type: Ontology
version IRI: hsapdv.owl
auto-generated-by: OBO-Edit 1.101
date: 03:05:2012 18:48
default-namespace: human_stages_ontology
has_obo_format_version: 1.2
saved-by: fbb
treat-xrefs-as-equivalent: EV
treat-xrefs-as-equivalent: XUO

definition
type: AnnotationProperty

month of gestation
type: AnnotationProperty
definition: Defines the start and end of a stage with a duration of 1 month, relative to either the time of fertilization or last menstrual period of the mother (to be clarified), counting from one, in terms of a reference model. Thus if month_of_gestation=3, then the stage is 2 month in.
has unit: UO_0000035
database_cross_reference: Wikipedia:Gestational_age
has_obo_namespace: human_stages_ontology
id: month_of_gestation
is metadata tag: true
shorthand: month_of_gestation
comment: This is a shortcut annotation that can be expanded to an OWL axiom, or to a set of OWL axioms. The exact translation has yet to be determined, and may be application-dependent.

end, days post fertilization
type: AnnotationProperty
definition: Count of number of days intervening between the end of the stage and the time of fertilization according to a reference model. Note that the first day of development has the value of 1 for this property.
has unit: UO_0000033
has_obo_namespace: human_stages_ontology
id: end_dpf
is metadata tag: true
comment: This is a shortcut annotation that can be expanded to an OWL axiom, or to a set of OWL axioms. The exact translation has yet to be determined, and may be application-dependent.

end, months post birth
type: AnnotationProperty
definition: Count of number of months intervening between the end of the stage and the time of birth according to a reference model. Note that the first month of post-birth development has the value of 1 for this property, and the period during which the child is one month old has the value 2
has unit: UO_0000035
has_obo_namespace: human_stages_ontology
id: end_mpb
is metadata tag: true
comment: This is a shortcut annotation that can be expanded to an OWL axiom, or to a set of OWL axioms. The exact translation has yet to be determined, and may be application-dependent.

end, years post birth
type: AnnotationProperty
definition: Count of number of years intervening between the end of the stage and the time of birth according to a reference model. Note that the first year of post-birth development has the value of 1 for this property, and the period during which the child is one year old has the value 2
has unit: UO_0000036
has_obo_namespace: human_stages_ontology
id: end_ypb
is metadata tag: true
comment: This is a shortcut annotation that can be expanded to an OWL axiom, or to a set of OWL axioms. The exact translation has yet to be determined, and may be application-dependent.

granular stage
type: AnnotationProperty
comment: Subset consisting of classes describing highly granular developmental stages (for instance, '23-year-old'). Such stages might be useful for annotation purpose, but might be folded into less granular parents for display purpose.
sub property of: subset_property

has end time
type: AnnotationProperty
has_obo_namespace: human_stages_ontology
id: has_end_time
is metadata tag: true

has stage marker
type: AnnotationProperty
definition: A relationship between a stage class and an anatomical structure or developmental process class, in which the stage is characterized by the appearance of the structure or the occurrence of the biological process
has_obo_namespace: human_stages_ontology
id: has_stage_marker
is metadata tag: true
comment: This is a shortcut annotation that can be expanded to an OWL axiom, or to a set of OWL axioms. The exact translation has yet to be determined, and may be application-dependent.

has start time
type: AnnotationProperty
has_obo_namespace: human_stages_ontology
id: has_start_time
is metadata tag: true

has unit
type: AnnotationProperty
has_obo_namespace: human_stages_ontology
id: has_unit
is metadata tag: true
comment: Used to associate a measurement property (e.g. days post fertilization) with a unit (e.g. days)

start, days post fertilization
type: AnnotationProperty
definition: Count of number of days intervening between the start of the stage and the time of fertilization according to a reference model. Note that the first day of development has the value of 0 for this property.
has unit: UO_0000033
has_obo_namespace: human_stages_ontology
id: start_dpf
is metadata tag: true
comment: This is a shortcut annotation that can be expanded to an OWL axiom, or to a set of OWL axioms. The exact translation has yet to be determined, and may be application-dependent.

start, months post birth
type: AnnotationProperty
definition: Count of number of months intervening between the start of the stage and the time of birth according to a reference model. Note that the first month of post-birth development has the value of 0 for this property, and the period during which the child is one month old has the value 1.
has unit: UO_0000035
has_obo_namespace: human_stages_ontology
id: start_mpb
is metadata tag: true
comment: This is a shortcut annotation that can be expanded to an OWL axiom, or to a set of OWL axioms. The exact translation has yet to be determined, and may be application-dependent.

start, years post birth
type: AnnotationProperty
definition: Count of number of years intervening between the start of the stage and the time of birth according to a reference model. Note that the first year of post-birth development has the value of 0 for this property, and the period during which the child is one year old has the value 1.
has unit: UO_0000036
has_obo_namespace: human_stages_ontology
id: start_ypb
is metadata tag: true
comment: This is a shortcut annotation that can be expanded to an OWL axiom, or to a set of OWL axioms. The exact translation has yet to be determined, and may be application-dependent.

subset_property
type: AnnotationProperty

database_cross_reference
type: AnnotationProperty

has_exact_synonym
type: AnnotationProperty

has_narrow_synonym
type: AnnotationProperty

has_obo_format_version
type: AnnotationProperty

has_obo_namespace
type: AnnotationProperty

has_related_synonym
type: AnnotationProperty

in_subset
type: AnnotationProperty

shorthand
type: AnnotationProperty

treat-xrefs-as-equivalent
type: AnnotationProperty

part of
type: ObjectProperty
type: TransitiveProperty
database_cross_reference: BFO:0000050
has_obo_namespace: human_stages_ontology
id: part_of
shorthand: part_of

preceded_by
type: ObjectProperty
type: TransitiveProperty
definition: X preceded_by Y iff: end(Y) before_or_simultaneous_with start(X)
database_cross_reference: BFO:0000062
has_obo_namespace: human_stages_ontology
id: preceded_by
shorthand: preceded_by

immediately_preceded_by
type: ObjectProperty
sub property of: preceded_by
definition: X immediately_preceded_by Y iff: end(X) simultaneous_with start(Y)
database_cross_reference: RO:0002087
has_obo_namespace: human_stages_ontology
id: immediately_preceded_by
shorthand: immediately_preceded_by

human life cycle stage
type: Class
definition: A spatiotemporal region encompassing some part of the life cycle of an organism.
database_cross_reference: UBERON:0000105
has_exact_synonym: developmental stage
has_narrow_synonym: stage
has_obo_namespace: human_stages_ontology
id: HsapDv:0000000

Axiom
annotated source: human life cycle stage
annotated property: definition
annotated target: A spatiotemporal region encompassing some part of the life cycle of an organism.
database_cross_reference: UBERON:0000105

human life cycle
type: Class
subclass of: human life cycle stage
definition: Temporal interval that defines human life from the prenatal stage until late adulthood.
start, days post fertilization: 0.0
database_cross_reference: UBERON:0000104
has_obo_namespace: human_developmental_stage
id: HsapDv:0000001

Axiom
annotated source: human life cycle
annotated property: definition
annotated target: Temporal interval that defines human life from the prenatal stage until late adulthood.
database_cross_reference: Bgee:curator

embryonic human stage
type: Class
subclass of: human life cycle stage
subclass of: Restriction
  on property: part of
  some values from: prenatal stage
definition: Prenatal stage that starts with fertilization and ends with a fully formed embryo, before undergoing last development during the fetal stage.
end, days post fertilization: 56.0
start, days post fertilization: 0.0
database_cross_reference: EV:0300001
database_cross_reference: FMA:72652
has_obo_namespace: human_developmental_stage
has_related_synonym: embryo stage
has_related_synonym: first trimester
id: HsapDv:0000002
comment: By embryo we mean in the sense of up to the 8th week postfertilization (over 7 and under 8 weeks), we treat fetus as a separate stage.

Axiom
annotated source: embryonic human stage
annotated property: definition
annotated target: Prenatal stage that starts with fertilization and ends with a fully formed embryo, before undergoing last development during the fetal stage.
database_cross_reference: Bgee:curator

Axiom
annotated source: embryonic human stage
annotated property: has_related_synonym
annotated target: first trimester
database_cross_reference: http://en.wikipedia.org/wiki/Gestational_age

Carnegie stage 01
type: Class
subclass of: human life cycle stage
subclass of: Restriction
  on property: part of
  some values from: embryonic human stage
definition: Embryonic stage defined by a fertilized oocyte and presence of pronuclei.
start, days post fertilization: 0.0
database_cross_reference: EHDAA2:CS01
database_cross_reference: FMA:295882
database_cross_reference: UBERON:0000106
database_cross_reference: XUO:0000130
has_exact_synonym: CS01
has_obo_namespace: human_developmental_stage
id: HsapDv:0000003
comment: Starts at day 1 post-fertilization, beginning of the first week.

Axiom
annotated source: Carnegie stage 01
annotated property: definition
annotated target: Embryonic stage defined by a fertilized oocyte and presence of pronuclei.
database_cross_reference: http://embryology.med.unsw.edu.au/embryology/index.php

Axiom
annotated source: Carnegie stage 01
annotated property: has_exact_synonym
annotated target: CS01
database_cross_reference: EHDAA2:CS01

cleavage stage
type: Class
subclass of: human life cycle stage
subclass of: Restriction
  on property: part of
  some values from: embryonic human stage
subclass of: Restriction
  on property: immediately_preceded_by
  some values from: Carnegie stage 01
definition: Early stage of Carnegie stage 02 consisting of division of cells in the early embryo.
database_cross_reference: UBERON:0000107
has_obo_namespace: human_developmental_stage
id: HsapDv:0000004

Axiom
annotated source: cleavage stage
annotated property: definition
annotated target: Early stage of Carnegie stage 02 consisting of division of cells in the early embryo.
database_cross_reference: Bgee:curator

Carnegie stage 02
type: Class
subclass of: human life cycle stage
subclass of: Restriction
  on property: part of
  some values from: cleavage stage
subclass of: Restriction
  on property: preceded_by
  some values from: Carnegie stage 01
definition: Embryonic stage during which cell division occurs with reduction in cytoplasmic volume, and formation of inner and outer cell mass.
start, days post fertilization: 2.5
database_cross_reference: EHDAA2:CS02
database_cross_reference: FMA:295884
database_cross_reference: XUO:0000131
has_exact_synonym: CS02
has_obo_namespace: human_developmental_stage
id: HsapDv:0000005
comment: Usually starts between day 2 and day 3 post-fertilization.

Axiom
annotated source: Carnegie stage 02
annotated property: definition
annotated target: Embryonic stage during which cell division occurs with reduction in cytoplasmic volume, and formation of inner and outer cell mass.
database_cross_reference: http://embryology.med.unsw.edu.au/embryology/index.php

Axiom
annotated source: Carnegie stage 02
annotated property: has_exact_synonym
annotated target: CS02
database_cross_reference: EHDAA2:CS02

blastula stage
type: Class
subclass of: human life cycle stage
subclass of: Restriction
  on property: part of
  some values from: embryonic human stage
subclass of: Restriction
  on property: preceded_by
  some values from: Carnegie stage 02
definition: Embryonic stage that is an early stage of embryonic development in animals and is produced by cleavage of a fertilized ovum, with formation of a central fluid-filled cavity called the blastocoel.
database_cross_reference: UBERON:0000108
has_obo_namespace: human_developmental_stage
id: HsapDv:0000006
comment: The blastula follows the morula and precedes the gastrula in the developmental sequence.

Axiom
annotated source: blastula stage
annotated property: definition
annotated target: Embryonic stage that is an early stage of embryonic development in animals and is produced by cleavage of a fertilized ovum, with formation of a central fluid-filled cavity called the blastocoel.
database_cross_reference: UBERON:0000108

Carnegie stage 03
type: Class
subclass of: human life cycle stage
subclass of: Restriction
  on property: part of
  some values from: blastula stage
subclass of: Restriction
  on property: immediately_preceded_by
  some values from: morula stage
definition: Blastula stage with the loss of the zona pellucida and the definition of a free blastocyst.
has stage marker: GO_0001835
start, days post fertilization: 4.5
database_cross_reference: EHDAA2:CS03
database_cross_reference: FMA:295907
database_cross_reference: XUO:0000132
has_exact_synonym: CS03
has_obo_namespace: human_developmental_stage
id: HsapDv:0000007
comment: Usually starts between day 4 and day 5 post-fertilization.

Axiom
annotated source: Carnegie stage 03
annotated property: definition
annotated target: Blastula stage with the loss of the zona pellucida and the definition of a free blastocyst.
database_cross_reference: http://embryology.med.unsw.edu.au/embryology/index.php

Axiom
annotated source: Carnegie stage 03
annotated property: has_exact_synonym
annotated target: CS03
database_cross_reference: EHDAA2:CS03

Carnegie stage 04
type: Class
subclass of: human life cycle stage
subclass of: Restriction
  on property: part of
  some values from: blastula stage
subclass of: Restriction
  on property: immediately_preceded_by
  some values from: Carnegie stage 03
definition: Blastula stage during which the blastocyst becomes attached.
editor notes: Note that GO treats blastocyst attachment and implantation (CS05) as synonymous
start, days post fertilization: 5.5
database_cross_reference: EHDAA2:CS04
database_cross_reference: FMA:295908
database_cross_reference: XUO:0000133
has_exact_synonym: CS04
has_obo_namespace: human_developmental_stage
id: HsapDv:0000008
comment: Usually starts between day 5 and day 6 post-fertilization.

Axiom
annotated source: Carnegie stage 04
annotated property: definition
annotated target: Blastula stage during which the blastocyst becomes attached.
database_cross_reference: http://embryology.med.unsw.edu.au/embryology/index.php

Axiom
annotated source: Carnegie stage 04
annotated property: has_exact_synonym
annotated target: CS04
database_cross_reference: EHDAA2:CS04

Carnegie stage 05
type: Class
subclass of: human life cycle stage
subclass of: Restriction
  on property: part of
  some values from: blastula stage
subclass of: Restriction
  on property: immediately_preceded_by
  some values from: Carnegie stage 04
definition: Blastula stage during which implantation occurs.
has stage marker: GO_0007566
start, days post fertilization: 7.0
database_cross_reference: FMA:295909
database_cross_reference: XUO:0000134
has_exact_synonym: CS04
has_obo_namespace: human_developmental_stage
id: HsapDv:0000009
comment: Usually starts between day 7 and day 12 post-fertilization, beginning of the second week.

Axiom
annotated source: Carnegie stage 05
annotated property: definition
annotated target: Blastula stage during which implantation occurs.
database_cross_reference: http://embryology.med.unsw.edu.au/embryology/index.php

gastrula stage
type: Class
subclass of: human life cycle stage
subclass of: Restriction
  on property: part of
  some values from: embryonic human stage
subclass of: Restriction
  on property: preceded_by
  some values from: blastula stage
definition: Embryonic stage defined by a complex and coordinated series of cellular movements that occurs at the end of cleavage.
database_cross_reference: UBERON:0000109
has_obo_namespace: human_developmental_stage
id: HsapDv:0000010

Axiom
annotated source: gastrula stage
annotated property: definition
annotated target: Embryonic stage defined by a complex and coordinated series of cellular movements that occurs at the end of cleavage.
database_cross_reference: UBERON:0000109

Carnegie stage 06
type: Class
subclass of: human life cycle stage
subclass of: Restriction
  on property: part of
  some values from: gastrula stage
subclass of: Restriction
  on property: immediately_preceded_by
  some values from: Carnegie stage 05
subclass of: Restriction
  on property: immediately_preceded_by
  some values from: Carnegie stage 05c
definition: Gastrula stage during which the extraembryonic mesoderm and primitive streak appear.
has stage marker: EHDAA2_0000474
has stage marker: EHDAA2_0001525
start, days post fertilization: 13.0
database_cross_reference: FMA:295910
database_cross_reference: XUO:0000135
has_exact_synonym: CS06
has_obo_namespace: human_developmental_stage
id: HsapDv:0000011
comment: Usually starts between day 13 and day 15 post-fertilization.

Axiom
annotated source: Carnegie stage 06
annotated property: definition
annotated target: Gastrula stage during which the extraembryonic mesoderm and primitive streak appear.
database_cross_reference: http://embryology.med.unsw.edu.au/embryology/index.php

neurula stage
type: Class
subclass of: human life cycle stage
subclass of: Restriction
  on property: part of
  some values from: embryonic human stage
subclass of: Restriction
  on property: preceded_by
  some values from: gastrula stage
definition: Embryonic stage defined by the formation of a tube from the flat layer of ectodermal cells known as the neural plate.
has stage marker: EHDAA2_0001254
database_cross_reference: UBERON:0000110
has_obo_namespace: human_developmental_stage
id: HsapDv:0000012
comment: This stage starts the emergence of the central nervous system.

Axiom
annotated source: neurula stage
annotated property: definition
annotated target: Embryonic stage defined by the formation of a tube from the flat layer of ectodermal cells known as the neural plate.
database_cross_reference: UBERON:0000110

Carnegie stage 07
type: Class
subclass of: human life cycle stage
subclass of: Restriction
  on property: part of
  some values from: neurula stage
subclass of: Restriction
  on property: immediately_preceded_by
  some values from: Carnegie stage 06
subclass of: Restriction
  on property: immediately_preceded_by
  some values from: Carnegie stage 06b
definition: Neurula stage during which the notochordal process appears, and gastrulation is continuing.
has stage marker: EHDAA2_0001279
start, days post fertilization: 15.0
database_cross_reference: EHDAA2:CS07
database_cross_reference: FMA:295911
database_cross_reference: XUO:0000136
has_exact_synonym: CS07
has_obo_namespace: human_developmental_stage
id: HsapDv:0000013
comment: Usually starts between day 15 and day 17 post-fertilization, beginning of the third week.

Axiom
annotated source: Carnegie stage 07
annotated property: definition
annotated target: Neurula stage during which the notochordal process appears, and gastrulation is continuing.
database_cross_reference: http://embryology.med.unsw.edu.au/embryology/index.php

Axiom
annotated source: Carnegie stage 07
annotated property: has_exact_synonym
annotated target: CS07
database_cross_reference: EHDAA2:CS07

Carnegie stage 08
type: Class
subclass of: human life cycle stage
subclass of: Restriction
  on property: part of
  some values from: neurula stage
subclass of: Restriction
  on property: immediately_preceded_by
  some values from: Carnegie stage 07
definition: Neurula stage during which the primitive pit and the notochordal canal appear.
has stage marker: EHDAA2_0001521
has stage marker: UBERON_0013704
start, days post fertilization: 17.0
database_cross_reference: EHDAA2:CS08
database_cross_reference: FMA:295912
database_cross_reference: XUO:0000137
has_exact_synonym: CS08
has_obo_namespace: human_developmental_stage
id: HsapDv:0000014
comment: Usually starts between day 17 and day 19 post-fertilization.

Axiom
annotated source: Carnegie stage 08
annotated property: definition
annotated target: Neurula stage during which the primitive pit and the notochordal canal appear.
database_cross_reference: http://embryology.med.unsw.edu.au/embryology/index.php

Axiom
annotated source: Carnegie stage 08
annotated property: has_exact_synonym
annotated target: CS08
database_cross_reference: EHDAA2:CS08

organogenesis stage
type: Class
subclass of: human life cycle stage
subclass of: Restriction
  on property: part of
  some values from: embryonic human stage
subclass of: Restriction
  on property: preceded_by
  some values from: neurula stage
definition: Embryonic stage at which the ectoderm, endoderm, and mesoderm develop into the internal organs of the organism.
database_cross_reference: UBERON:0000111
has_obo_namespace: human_developmental_stage
id: HsapDv:0000015

Axiom
annotated source: organogenesis stage
annotated property: definition
annotated target: Embryonic stage at which the ectoderm, endoderm, and mesoderm develop into the internal organs of the organism.
database_cross_reference: UBERON:0000111

Carnegie stage 09
type: Class
subclass of: human life cycle stage
subclass of: Restriction
  on property: part of
  some values from: organogenesis stage
subclass of: Restriction
  on property: immediately_preceded_by
  some values from: Carnegie stage 08
definition: Organogenesis stage during which somites 1-3 appear, and neural folds, cardiac primordium, and head fold are present.
has stage marker: EHDAA2_0000214
has stage marker: EHDAA2_0001249
has stage marker: EHDAA2_0001849
has stage marker: EHDAA2_0001850
has stage marker: EHDAA2_0001851
start, days post fertilization: 19.0
database_cross_reference: EHDAA2:CS09
database_cross_reference: FMA:295913
database_cross_reference: XUO:0000138
has_exact_synonym: CS09
has_obo_namespace: human_developmental_stage
id: HsapDv:0000016
comment: Usually starts between day 19 and day 21 post-fertilization.

Axiom
annotated source: Carnegie stage 09
annotated property: definition
annotated target: Organogenesis stage during which somites 1-3 appear, and neural folds, cardiac primordium, and head fold are present.
database_cross_reference: http://embryology.med.unsw.edu.au/embryology/index.php

Axiom
annotated source: Carnegie stage 09
annotated property: has_exact_synonym
annotated target: CS09
database_cross_reference: EHDAA2:CS09

Carnegie stage 10
type: Class
subclass of: human life cycle stage
subclass of: Restriction
  on property: part of
  some values from: organogenesis stage
subclass of: Restriction
  on property: immediately_preceded_by
  some values from: Carnegie stage 09
definition: Organogenesis stage during which somites 4-12 appear, and the neural fold fuses.
has stage marker: EHDAA2_0001852
has stage marker: EHDAA2_0001853
has stage marker: EHDAA2_0001854
has stage marker: EHDAA2_0001855
has stage marker: EHDAA2_0001856
has stage marker: EHDAA2_0001857
has stage marker: EHDAA2_0001858
has stage marker: EHDAA2_0001859
has stage marker: EHDAA2_0001860
has stage marker: GO_0001843
start, days post fertilization: 22.0
database_cross_reference: EHDAA2:CS10
database_cross_reference: FMA:295914
database_cross_reference: XUO:0000139
has_exact_synonym: CS10
has_obo_namespace: human_developmental_stage
id: HsapDv:0000017
comment: Usually starts between day 22 and day 23 post-fertilization, beginning of the fourth week.

Axiom
annotated source: Carnegie stage 10
annotated property: definition
annotated target: Organogenesis stage during which somites 4-12 appear, and the neural fold fuses.
database_cross_reference: http://embryology.med.unsw.edu.au/embryology/index.php

Axiom
annotated source: Carnegie stage 10
annotated property: has_exact_synonym
annotated target: CS10
database_cross_reference: EHDAA2:CS10

Carnegie stage 11
type: Class
subclass of: human life cycle stage
subclass of: Restriction
  on property: part of
  some values from: organogenesis stage
subclass of: Restriction
  on property: immediately_preceded_by
  some values from: Carnegie stage 10
definition: Organogenesis stage during which somites 13-20 appear, and the rostral neuropore closes.
has stage marker: EHDAA2_0001861
has stage marker: EHDAA2_0001862
has stage marker: EHDAA2_0001863
has stage marker: EHDAA2_0001864
has stage marker: EHDAA2_0001865
has stage marker: EHDAA2_0001866
has stage marker: EHDAA2_0001867
has stage marker: EHDAA2_0001868
start, days post fertilization: 23.0
database_cross_reference: EHDAA2:CS11
database_cross_reference: FMA:295915
database_cross_reference: XUO:0000140
has_exact_synonym: CS11
has_obo_namespace: human_developmental_stage
id: HsapDv:0000018
comment: Usually starts between day 23 and day 26 post-fertilization.

Axiom
annotated source: Carnegie stage 11
annotated property: definition
annotated target: Organogenesis stage during which somites 13-20 appear, and the rostral neuropore closes.
database_cross_reference: http://embryology.med.unsw.edu.au/embryology/index.php

Axiom
annotated source: Carnegie stage 11
annotated property: has_exact_synonym
annotated target: CS11
database_cross_reference: EHDAA2:CS11

Carnegie stage 12
type: Class
subclass of: human life cycle stage
subclass of: Restriction
  on property: part of
  some values from: organogenesis stage
subclass of: Restriction
  on property: immediately_preceded_by
  some values from: Carnegie stage 11
definition: Organogenesis stage during which somites 21-29 appear, and the caudal neuropore closes.
has stage marker: EHDAA2_0001869
has stage marker: EHDAA2_0001870
has stage marker: EHDAA2_0001871
has stage marker: EHDAA2_0001872
has stage marker: EHDAA2_0001873
has stage marker: EHDAA2_0001874
has stage marker: EHDAA2_0001875
has stage marker: EHDAA2_0001876
has stage marker: EHDAA2_0001877
has stage marker: GO_0021507
start, days post fertilization: 26.0
database_cross_reference: EHDAA2:CS12
database_cross_reference: FMA:295916
database_cross_reference: XUO:0000141
has_exact_synonym: CS12
has_obo_namespace: human_developmental_stage
id: HsapDv:0000019
comment: Usually starts between day 26 and day 30 post-fertilization.

Axiom
annotated source: Carnegie stage 12
annotated property: definition
annotated target: Organogenesis stage during which somites 21-29 appear, and the caudal neuropore closes.
database_cross_reference: http://embryology.med.unsw.edu.au/embryology/index.php

Axiom
annotated source: Carnegie stage 12
annotated property: has_exact_synonym
annotated target: CS12
database_cross_reference: EHDAA2:CS12

Carnegie stage 13
type: Class
subclass of: human life cycle stage
subclass of: Restriction
  on property: part of
  some values from: organogenesis stage
subclass of: Restriction
  on property: immediately_preceded_by
  some values from: Carnegie stage 12
definition: Organogenesis developmental stage during which somite 30 appears, and leg buds, lens placode, pharyngeal arches are present.
has stage marker: EHDAA2_0000982
has stage marker: EHDAA2_0001033
has stage marker: EHDAA2_0001878
start, days post fertilization: 28.0
database_cross_reference: EHDAA2:CS13
database_cross_reference: FMA:295917
database_cross_reference: XUO:0000142
has_exact_synonym: CS13
has_obo_namespace: human_developmental_stage
id: HsapDv:0000020
comment: Usually starts between day 28 and day 32 post-fertilization, beginning of the fifth week.

Axiom
annotated source: Carnegie stage 13
annotated property: definition
annotated target: Organogenesis developmental stage during which somite 30 appears, and leg buds, lens placode, pharyngeal arches are present.
database_cross_reference: http://embryology.med.unsw.edu.au/embryology/index.php

Axiom
annotated source: Carnegie stage 13
annotated property: has_exact_synonym
annotated target: CS13
database_cross_reference: EHDAA2:CS13

Carnegie stage 14
type: Class
subclass of: human life cycle stage
subclass of: Restriction
  on property: part of
  some values from: organogenesis stage
subclass of: Restriction
  on property: immediately_preceded_by
  some values from: Carnegie stage 13
definition: Organogenesis stage during which lens pit and optic cup appear.
has stage marker: EHDAA2_0000981
has stage marker: EHDAA2_0001303
start, days post fertilization: 31.0
database_cross_reference: EHDAA2:CS14
database_cross_reference: FMA:295918
database_cross_reference: XUO:0000143
has_exact_synonym: CS14
has_obo_namespace: human_developmental_stage
id: HsapDv:0000021
comment: Usually starts between day 31 and day 35 post-fertilization.

Axiom
annotated source: Carnegie stage 14
annotated property: definition
annotated target: Organogenesis stage during which lens pit and optic cup appear.
database_cross_reference: http://embryology.med.unsw.edu.au/embryology/index.php

Axiom
annotated source: Carnegie stage 14
annotated property: has_exact_synonym
annotated target: CS14
database_cross_reference: EHDAA2:CS14

Carnegie stage 15
type: Class
subclass of: human life cycle stage
subclass of: Restriction
  on property: part of
  some values from: organogenesis stage
subclass of: Restriction
  on property: immediately_preceded_by
  some values from: Carnegie stage 14
definition: Organogenesis stage during which lens vesicle, nasal pit, and hand plate appear.
has stage marker: EHDAA2_0000728
has stage marker: EHDAA2_0000983
has stage marker: UBERON_0005426
has stage marker: UBERON_0005870
has stage marker: UBERON_0006875
start, days post fertilization: 35.0
database_cross_reference: EHDAA2:CS15
database_cross_reference: FMA:295928
database_cross_reference: XUO:0000144
has_exact_synonym: CS15
has_obo_namespace: human_developmental_stage
id: HsapDv:0000022
comment: Usually starts between day 35 and day 38 post-fertilization.

Axiom
annotated source: Carnegie stage 15
annotated property: definition
annotated target: Organogenesis stage during which lens vesicle, nasal pit, and hand plate appear.
database_cross_reference: http://embryology.med.unsw.edu.au/embryology/index.php

Axiom
annotated source: Carnegie stage 15
annotated property: has_exact_synonym
annotated target: CS15
database_cross_reference: EHDAA2:CS15

Carnegie stage 16
type: Class
subclass of: human life cycle stage
subclass of: Restriction
  on property: part of
  some values from: organogenesis stage
subclass of: Restriction
  on property: immediately_preceded_by
  some values from: Carnegie stage 15
definition: Organogenesis stage during which nasal pits moved ventrally, and features are auricular hillocks, and foot plate.
has stage marker: EHDAA2_0000155
has stage marker: EHDAA2_0000546
has stage marker: UBERON_0006871
start, days post fertilization: 37.0
database_cross_reference: EHDAA2:CS16
database_cross_reference: FMA:295919
database_cross_reference: XUO:0000145
has_exact_synonym: CS16
has_obo_namespace: human_developmental_stage
id: HsapDv:0000023
comment: Usually starts between day 37 and day 42 post-fertilization, beginning of the sixth week.

Axiom
annotated source: Carnegie stage 16
annotated property: definition
annotated target: Organogenesis stage during which nasal pits moved ventrally, and features are auricular hillocks, and foot plate.
database_cross_reference: http://embryology.med.unsw.edu.au/embryology/index.php

Axiom
annotated source: Carnegie stage 16
annotated property: has_exact_synonym
annotated target: CS16
database_cross_reference: EHDAA2:CS16

Carnegie stage 17
type: Class
subclass of: human life cycle stage
subclass of: Restriction
  on property: part of
  some values from: organogenesis stage
subclass of: Restriction
  on property: immediately_preceded_by
  some values from: Carnegie stage 16
definition: Organogenesis stage during which finger rays become visible.
start, days post fertilization: 42.0
database_cross_reference: EHDAA2:CS17
database_cross_reference: FMA:295920
database_cross_reference: XUO:0000146
has_exact_synonym: CS17
has_obo_namespace: human_developmental_stage
id: HsapDv:0000024
comment: Usually starts between day 42 and day 44 post-fertilization.

Axiom
annotated source: Carnegie stage 17
annotated property: definition
annotated target: Organogenesis stage during which finger rays become visible.
database_cross_reference: http://embryology.med.unsw.edu.au/embryology/index.php

Axiom
annotated source: Carnegie stage 17
annotated property: has_exact_synonym
annotated target: CS17
database_cross_reference: EHDAA2:CS17

Carnegie stage 18
type: Class
subclass of: human life cycle stage
subclass of: Restriction
  on property: part of
  some values from: organogenesis stage
subclass of: Restriction
  on property: immediately_preceded_by
  some values from: Carnegie stage 17
definition: Organogenesis stage during which ossification commences.
has stage marker: GO_0001503
start, days post fertilization: 44.0
database_cross_reference: EHDAA2:CS18
database_cross_reference: FMA:295921
database_cross_reference: XUO:0000147
has_exact_synonym: CS18
has_obo_namespace: human_developmental_stage
id: HsapDv:0000025
comment: Usually starts between day 44 and day 48 post-fertilization, beginning of the seventh week.

Axiom
annotated source: Carnegie stage 18
annotated property: definition
annotated target: Organogenesis stage during which ossification commences.
database_cross_reference: http://embryology.med.unsw.edu.au/embryology/index.php

Axiom
annotated source: Carnegie stage 18
annotated property: has_exact_synonym
annotated target: CS18
database_cross_reference: EHDAA2:CS18

Carnegie stage 19
type: Class
subclass of: human life cycle stage
subclass of: Restriction
  on property: part of
  some values from: organogenesis stage
subclass of: Restriction
  on property: immediately_preceded_by
  some values from: Carnegie stage 18
definition: Organogenesis stage during which the straightening of the trunk starts.
start, days post fertilization: 48.0
database_cross_reference: EHDAA2:CS19
database_cross_reference: FMA:295922
database_cross_reference: XUO:0000148
has_exact_synonym: CS19
has_obo_namespace: human_developmental_stage
id: HsapDv:0000026
comment: Usually starts between day 48 and day 51 post-fertilization.

Axiom
annotated source: Carnegie stage 19
annotated property: definition
annotated target: Organogenesis stage during which the straightening of the trunk starts.
database_cross_reference: http://embryology.med.unsw.edu.au/embryology/index.php

Axiom
annotated source: Carnegie stage 19
annotated property: has_exact_synonym
annotated target: CS19
database_cross_reference: EHDAA2:CS19

Carnegie stage 20
type: Class
subclass of: human life cycle stage
subclass of: Restriction
  on property: part of
  some values from: organogenesis stage
subclass of: Restriction
  on property: immediately_preceded_by
  some values from: Carnegie stage 19
definition: Organogenesis stage during which upper limbs are longer and bent at elbow.
start, days post fertilization: 51.0
database_cross_reference: EHDAA2:CS20
database_cross_reference: FMA:295923
database_cross_reference: XUO:0000149
has_exact_synonym: CS20
has_obo_namespace: human_developmental_stage
id: HsapDv:0000027
comment: Usually starts between day 51 and day 53 post-fertilization, beginning of the eighth week.

Axiom
annotated source: Carnegie stage 20
annotated property: definition
annotated target: Organogenesis stage during which upper limbs are longer and bent at elbow.
database_cross_reference: http://embryology.med.unsw.edu.au/embryology/index.php

Axiom
annotated source: Carnegie stage 20
annotated property: has_exact_synonym
annotated target: CS20
database_cross_reference: EHDAA2:CS20

Carnegie stage 21
type: Class
subclass of: human life cycle stage
subclass of: Restriction
  on property: part of
  some values from: organogenesis stage
subclass of: Restriction
  on property: immediately_preceded_by
  some values from: Carnegie stage 20
definition: Organogenesis stage during which hands and feet turned inward.
start, days post fertilization: 53.0
database_cross_reference: FMA:295924
database_cross_reference: XUO:0000150
has_exact_synonym: CS21
has_obo_namespace: human_developmental_stage
id: HsapDv:0000028
comment: Usually starts between day 53 and day 54 post-fertilization.

Axiom
annotated source: Carnegie stage 21
annotated property: definition
annotated target: Organogenesis stage during which hands and feet turned inward.
database_cross_reference: http://embryology.med.unsw.edu.au/embryology/index.php

Carnegie stage 22
type: Class
subclass of: human life cycle stage
subclass of: Restriction
  on property: part of
  some values from: organogenesis stage
subclass of: Restriction
  on property: immediately_preceded_by
  some values from: Carnegie stage 21
definition: Organogenesis stage during which eyelids and external ears appear.
has stage marker: EHDAA2_0000462
has stage marker: UBERON_0001711
start, days post fertilization: 54.0
database_cross_reference: FMA:295925
database_cross_reference: XUO:0000151
has_exact_synonym: CS22
has_obo_namespace: human_developmental_stage
id: HsapDv:0000029
comment: Usually starts between day 54 and day 56 post-fertilization.

Axiom
annotated source: Carnegie stage 22
annotated property: definition
annotated target: Organogenesis stage during which eyelids and external ears appear.
database_cross_reference: http://embryology.med.unsw.edu.au/embryology/index.php

Carnegie stage 23
type: Class
subclass of: human life cycle stage
subclass of: Restriction
  on property: part of
  some values from: organogenesis stage
subclass of: Restriction
  on property: immediately_preceded_by
  some values from: Carnegie stage 22
definition: Organogenesis stage during which the head, the body, and the limbs are rounded structures.
start, days post fertilization: 56.0
database_cross_reference: FMA:295926
database_cross_reference: FMA:63631
database_cross_reference: XUO:0000152
has_exact_synonym: CS23
has_obo_namespace: human_developmental_stage
id: HsapDv:0000030
comment: Usually starts between day 56 and day 60 post-fertilization.

Axiom
annotated source: Carnegie stage 23
annotated property: definition
annotated target: Organogenesis stage during which the head, the body, and the limbs are rounded structures.
database_cross_reference: http://embryology.med.unsw.edu.au/embryology/index.php

Carnegie stage 05a
type: Class
subclass of: human life cycle stage
subclass of: Restriction
  on property: part of
  some values from: Carnegie stage 05
subclass of: Restriction
  on property: immediately_preceded_by
  some values from: Carnegie stage 05
definition: Carnegie developmental stage 5 defined by a solid trophoblast.
database_cross_reference: EHDAA2:CS05a
database_cross_reference: FMA:296707
database_cross_reference: XUO:0000187
has_exact_synonym: CS05a
has_obo_namespace: human_developmental_stage
id: HsapDv:0000031

Axiom
annotated source: Carnegie stage 05a
annotated property: definition
annotated target: Carnegie developmental stage 5 defined by a solid trophoblast.
database_cross_reference: http://www.medicalmuseum.mil/assets/documents/collections/hdac/stage05.pdf

Axiom
annotated source: Carnegie stage 05a
annotated property: has_exact_synonym
annotated target: CS05a
database_cross_reference: EHDAA2:CS05a

Carnegie stage 05b
type: Class
subclass of: human life cycle stage
subclass of: Restriction
  on property: part of
  some values from: Carnegie stage 05
subclass of: Restriction
  on property: immediately_preceded_by
  some values from: Carnegie stage 05a
definition: Carnegie developmental stage 5 defined by a trophoblastic lacunae.
has stage marker: EHDAA2_0004715
database_cross_reference: EHDAA2:CS05b
database_cross_reference: FMA:296709
database_cross_reference: XUO:0000188
has_exact_synonym: CS05b
has_obo_namespace: human_developmental_stage
id: HsapDv:0000032

Axiom
annotated source: Carnegie stage 05b
annotated property: definition
annotated target: Carnegie developmental stage 5 defined by a trophoblastic lacunae.
database_cross_reference: http://www.medicalmuseum.mil/assets/documents/collections/hdac/stage05.pdf

Axiom
annotated source: Carnegie stage 05b
annotated property: has_exact_synonym
annotated target: CS05b
database_cross_reference: EHDAA2:CS05b

Carnegie stage 05c
type: Class
subclass of: human life cycle stage
subclass of: Restriction
  on property: part of
  some values from: Carnegie stage 05
subclass of: Restriction
  on property: immediately_preceded_by
  some values from: Carnegie stage 05b
definition: Carnegie developmental stage 5 defined by a lacunar vascular circle.
database_cross_reference: EHDAA2:CS05c
database_cross_reference: FMA:296711
database_cross_reference: XUO:0000189
has_exact_synonym: CS05c
has_obo_namespace: human_developmental_stage
id: HsapDv:0000033

Axiom
annotated source: Carnegie stage 05c
annotated property: definition
annotated target: Carnegie developmental stage 5 defined by a lacunar vascular circle.
database_cross_reference: http://www.medicalmuseum.mil/assets/documents/collections/hdac/stage05.pdf

Axiom
annotated source: Carnegie stage 05c
annotated property: has_exact_synonym
annotated target: CS05c
database_cross_reference: EHDAA2:CS05c

Carnegie stage 06a
type: Class
subclass of: human life cycle stage
subclass of: Restriction
  on property: part of
  some values from: Carnegie stage 06
subclass of: Restriction
  on property: immediately_preceded_by
  some values from: Carnegie stage 05
subclass of: Restriction
  on property: immediately_preceded_by
  some values from: Carnegie stage 05c
definition: Carnegie developmental stage 6 during which chorionic villi appear.
has stage marker: EHDAA2_0004717
database_cross_reference: EHDAA2:CS06a
database_cross_reference: XUO:0000190
has_exact_synonym: CS06a
has_obo_namespace: human_developmental_stage
id: HsapDv:0000034

Axiom
annotated source: Carnegie stage 06a
annotated property: definition
annotated target: Carnegie developmental stage 6 during which chorionic villi appear.
database_cross_reference: http://www.medicalmuseum.mil/assets/documents/collections/hdac/stage06.pdf

Axiom
annotated source: Carnegie stage 06a
annotated property: has_exact_synonym
annotated target: CS06a
database_cross_reference: EHDAA2:CS06a

Carnegie stage 06b
type: Class
subclass of: human life cycle stage
subclass of: Restriction
  on property: part of
  some values from: Carnegie stage 06
subclass of: Restriction
  on property: immediately_preceded_by
  some values from: Carnegie stage 06a
definition: Carnegie developmental stage 6 during which the primitive streak appears.
has stage marker: EHDAA2_0001525
database_cross_reference: EHDAA2:CS06b
database_cross_reference: XUO:0000191
has_exact_synonym: CS06b
has_obo_namespace: human_developmental_stage
id: HsapDv:0000035

Axiom
annotated source: Carnegie stage 06b
annotated property: definition
annotated target: Carnegie developmental stage 6 during which the primitive streak appears.
database_cross_reference: http://www.medicalmuseum.mil/assets/documents/collections/hdac/stage06.pdf

Axiom
annotated source: Carnegie stage 06b
annotated property: has_exact_synonym
annotated target: CS06b
database_cross_reference: EHDAA2:CS06b

fetal stage
type: Class
subclass of: human life cycle stage
subclass of: Restriction
  on property: part of
  some values from: prenatal stage
subclass of: Restriction
  on property: immediately_preceded_by
  some values from: embryonic human stage
definition: Prenatal stage that starts with the fully formed embryo and ends at birth.
end, days post fertilization: 266.0
start, days post fertilization: 56.0
database_cross_reference: EV:0300011
database_cross_reference: UBERON:0007220
has_obo_namespace: human_developmental_stage
has_related_synonym: fetus stage
has_related_synonym: foetus stage
has_related_synonym: second and third trimester
id: HsapDv:0000037
comment: Prenatal development is a continuum, with no clear defining feature distinguishing an embryo from a fetus. The use of the term "fetus" generally implies that a mammalian embryo has developed to the point of being recognizable as belonging to its own species, though the point at which this occurs is subjective. [Wikipedia:Fetus]

Axiom
annotated source: fetal stage
annotated property: definition
annotated target: Prenatal stage that starts with the fully formed embryo and ends at birth.
database_cross_reference: Bgee:curator

Axiom
annotated source: fetal stage
annotated property: has_related_synonym
annotated target: second and third trimester
database_cross_reference: http://en.wikipedia.org/wiki/Gestational_age

prenatal stage
type: Class
subclass of: human life cycle stage
subclass of: Restriction
  on property: part of
  some values from: human life cycle
definition: Prenatal stage that starts with fertilization and ends at birth.
end, days post fertilization: 266.0
end, years post birth: 0.0
start, days post fertilization: 0.0
database_cross_reference: UBERON:0000068
has_obo_namespace: human_developmental_stage
id: HsapDv:0000045

Axiom
annotated source: prenatal stage
annotated property: definition
annotated target: Prenatal stage that starts with fertilization and ends at birth.
database_cross_reference: UBERON:0000068

9th week post-fertilization human stage
type: Class
subclass of: human life cycle stage
subclass of: Restriction
  on property: part of
  some values from: third LMP month human stage
definition: Fetal stage when the fetus is over 8 and under 9 weeks of development.
end, days post fertilization: 63.0
start, days post fertilization: 56.0
database_cross_reference: EV:0300012
has_obo_namespace: human_developmental_stage
id: HsapDv:0000046
in_subset: granular stage
comment: External genitalia begin to distinguish themselves as either male or female. Eyelids are completely closed, and vocal ligaments appear (see http://ehd.org/resources_bpd_documentation_english.php).

Axiom
annotated source: 9th week post-fertilization human stage
annotated property: definition
annotated target: Fetal stage when the fetus is over 8 and under 9 weeks of development.
database_cross_reference: Bgee:curator

10th week post-fertilization human stage
type: Class
subclass of: human life cycle stage
subclass of: Restriction
  on property: part of
  some values from: third LMP month human stage
subclass of: Restriction
  on property: immediately_preceded_by
  some values from: 9th week post-fertilization human stage
definition: Fetal stage when the fetus is over 9 and under 10 weeks of development.
end, days post fertilization: 70.0
start, days post fertilization: 63.0
database_cross_reference: EV:0300013
has_obo_namespace: human_developmental_stage
id: HsapDv:0000047
in_subset: granular stage
comment: The fingernails and toenails begin to develop and unique fingerprints appear. Ossification is underway in most bones (see http://ehd.org/resources_bpd_documentation_english.php).

Axiom
annotated source: 10th week post-fertilization human stage
annotated property: definition
annotated target: Fetal stage when the fetus is over 9 and under 10 weeks of development.
database_cross_reference: Bgee:curator

11th week post-fertilization human stage
type: Class
subclass of: human life cycle stage
subclass of: Restriction
  on property: part of
  some values from: third LMP month human stage
subclass of: Restriction
  on property: immediately_preceded_by
  some values from: 10th week post-fertilization human stage
definition: Fetal stage when the fetus is over 10 and under 11 weeks of development.
end, days post fertilization: 77.0
has stage marker: UBERON_0001833
has stage marker: UBERON_0007827
start, days post fertilization: 70.0
database_cross_reference: EV:0300030
has_obo_namespace: human_developmental_stage
id: HsapDv:0000048
in_subset: granular stage
comment: The nose and lips are completely formed, and external genitalia can be distinguished as male or female (see http://ehd.org/resources_bpd_documentation_english.php).

Axiom
annotated source: 11th week post-fertilization human stage
annotated property: definition
annotated target: Fetal stage when the fetus is over 10 and under 11 weeks of development.
database_cross_reference: Bgee:curator

12th week post-fertilization human stage
type: Class
subclass of: human life cycle stage
subclass of: Restriction
  on property: part of
  some values from: fourth LMP month human stage
subclass of: Restriction
  on property: immediately_preceded_by
  some values from: 11th week post-fertilization human stage
definition: Fetal stage when the fetus is over 11 and under 12 weeks of development.
end, days post fertilization: 84.0
start, days post fertilization: 77.0
database_cross_reference: EV:0300014
has_obo_namespace: human_developmental_stage
id: HsapDv:0000049
in_subset: granular stage
comment: Upper limb length has nearly reached its final proportion to body size (see http://ehd.org/resources_bpd_documentation_english.php). The assignation of this week to the fourth or third LMP month is debatable (see http://en.wikipedia.org/wiki/File:Prenatal_development_table.svg).

Axiom
annotated source: 12th week post-fertilization human stage
annotated property: subClassOf
annotated target: Restriction
  on property: part of
  some values from: fourth LMP month human stage
notes: debatable

Axiom
annotated source: 12th week post-fertilization human stage
annotated property: definition
annotated target: Fetal stage when the fetus is over 11 and under 12 weeks of development.
database_cross_reference: Bgee:curator

13th week post-fertilization human stage
type: Class
subclass of: human life cycle stage
subclass of: Restriction
  on property: part of
  some values from: fourth LMP month human stage
subclass of: Restriction
  on property: immediately_preceded_by
  some values from: 12th week post-fertilization human stage
definition: Fetal stage when the fetus is over 12 and under 13 weeks of development.
end, days post fertilization: 91.0
start, days post fertilization: 84.0
database_cross_reference: EV:0300015
has_obo_namespace: human_developmental_stage
id: HsapDv:0000050
in_subset: granular stage

Axiom
annotated source: 13th week post-fertilization human stage
annotated property: definition
annotated target: Fetal stage when the fetus is over 12 and under 13 weeks of development.
database_cross_reference: Bgee:curator

14th week post-fertilization human stage
type: Class
subclass of: human life cycle stage
subclass of: Restriction
  on property: part of
  some values from: fourth LMP month human stage
subclass of: Restriction
  on property: immediately_preceded_by
  some values from: 13th week post-fertilization human stage
definition: Fetal stage when the fetus is over 13 and under 14 weeks of development.
end, days post fertilization: 98.0
start, days post fertilization: 91.0
database_cross_reference: EV:0300016
has_obo_namespace: human_developmental_stage
id: HsapDv:0000051
in_subset: granular stage

Axiom
annotated source: 14th week post-fertilization human stage
annotated property: definition
annotated target: Fetal stage when the fetus is over 13 and under 14 weeks of development.
database_cross_reference: Bgee:curator

15th week post-fertilization human stage
type: Class
subclass of: human life cycle stage
subclass of: Restriction
  on property: part of
  some values from: fourth LMP month human stage
subclass of: Restriction
  on property: immediately_preceded_by
  some values from: 14th week post-fertilization human stage
definition: Fetal stage when the fetus is over 14 and under 15 weeks of development.
end, days post fertilization: 105.0
start, days post fertilization: 98.0
database_cross_reference: EV:0300031
has_obo_namespace: human_developmental_stage
id: HsapDv:0000052
in_subset: granular stage

Axiom
annotated source: 15th week post-fertilization human stage
annotated property: definition
annotated target: Fetal stage when the fetus is over 14 and under 15 weeks of development.
database_cross_reference: Bgee:curator

16th week post-fertilization human stage
type: Class
subclass of: human life cycle stage
subclass of: Restriction
  on property: part of
  some values from: fifth LMP month human stage
subclass of: Restriction
  on property: immediately_preceded_by
  some values from: 15th week post-fertilization human stage
definition: Fetal stage when the fetus is over 15 and under 16 weeks of development.
end, days post fertilization: 112.0
start, days post fertilization: 105.0
database_cross_reference: EV:0300017
has_obo_namespace: human_developmental_stage
id: HsapDv:0000053
in_subset: granular stage
comment: The assignation of this week to the fifth or fourth LMP month is debatable (see http://en.wikipedia.org/wiki/File:Prenatal_development_table.svg).

Axiom
annotated source: 16th week post-fertilization human stage
annotated property: subClassOf
annotated target: Restriction
  on property: part of
  some values from: fifth LMP month human stage
notes: debatable

Axiom
annotated source: 16th week post-fertilization human stage
annotated property: definition
annotated target: Fetal stage when the fetus is over 15 and under 16 weeks of development.
database_cross_reference: Bgee:curator

17th week post-fertilization human stage
type: Class
subclass of: human life cycle stage
subclass of: Restriction
  on property: part of
  some values from: fifth LMP month human stage
subclass of: Restriction
  on property: immediately_preceded_by
  some values from: 16th week post-fertilization human stage
definition: Fetal stage when the fetus is over 16 and under 17 weeks of development.
end, days post fertilization: 119.0
start, days post fertilization: 112.0
database_cross_reference: EV:0300018
has_obo_namespace: human_developmental_stage
id: HsapDv:0000054
in_subset: granular stage

Axiom
annotated source: 17th week post-fertilization human stage
annotated property: definition
annotated target: Fetal stage when the fetus is over 16 and under 17 weeks of development.
database_cross_reference: Bgee:curator

18th week post-fertilization human stage
type: Class
subclass of: human life cycle stage
subclass of: Restriction
  on property: part of
  some values from: fifth LMP month human stage
subclass of: Restriction
  on property: immediately_preceded_by
  some values from: 17th week post-fertilization human stage
definition: Fetal stage when the fetus is over 17 and under 18 weeks of development.
end, days post fertilization: 126.0
start, days post fertilization: 119.0
database_cross_reference: EV:0300019
has_obo_namespace: human_developmental_stage
id: HsapDv:0000055
in_subset: granular stage

Axiom
annotated source: 18th week post-fertilization human stage
annotated property: definition
annotated target: Fetal stage when the fetus is over 17 and under 18 weeks of development.
database_cross_reference: Bgee:curator

19th week post-fertilization human stage
type: Class
subclass of: human life cycle stage
subclass of: Restriction
  on property: part of
  some values from: fifth LMP month human stage
subclass of: Restriction
  on property: immediately_preceded_by
  some values from: 18th week post-fertilization human stage
definition: Fetal stage when the fetus is over 18 and under 19 weeks of development.
end, days post fertilization: 133.0
start, days post fertilization: 126.0
database_cross_reference: EV:0300020
has_obo_namespace: human_developmental_stage
id: HsapDv:0000056
in_subset: granular stage

Axiom
annotated source: 19th week post-fertilization human stage
annotated property: definition
annotated target: Fetal stage when the fetus is over 18 and under 19 weeks of development.
database_cross_reference: Bgee:curator

20th week post-fertilization human stage
type: Class
subclass of: human life cycle stage
subclass of: Restriction
  on property: part of
  some values from: sixth LMP month human stage
subclass of: Restriction
  on property: immediately_preceded_by
  some values from: 19th week post-fertilization human stage
definition: Fetal stage when the fetus is over 19 and under 20 weeks of development.
end, days post fertilization: 140.0
start, days post fertilization: 133.0
database_cross_reference: EV:0300021
has_obo_namespace: human_developmental_stage
id: HsapDv:0000057
in_subset: granular stage
comment: The cochlea has reached adult size within the fully developed inner ear (see http://ehd.org/resources_bpd_documentation_english.php). The assignation of this week to the sixth or fifth LMP month is debatable (see http://en.wikipedia.org/wiki/File:Prenatal_development_table.svg).

Axiom
annotated source: 20th week post-fertilization human stage
annotated property: subClassOf
annotated target: Restriction
  on property: part of
  some values from: sixth LMP month human stage
notes: debatable

Axiom
annotated source: 20th week post-fertilization human stage
annotated property: definition
annotated target: Fetal stage when the fetus is over 19 and under 20 weeks of development.
database_cross_reference: Bgee:curator

21st week post-fertilization human stage
type: Class
subclass of: human life cycle stage
subclass of: Restriction
  on property: part of
  some values from: sixth LMP month human stage
subclass of: Restriction
  on property: immediately_preceded_by
  some values from: 20th week post-fertilization human stage
definition: Fetal stage when the fetus is over 20 and under 21 weeks of development.
end, days post fertilization: 147.0
start, days post fertilization: 140.0
database_cross_reference: EV:0300029
has_obo_namespace: human_developmental_stage
id: HsapDv:0000058
in_subset: granular stage
comment: The lungs gain some ability to breathe air. This stage is considered the age of viability because survival outside the womb becomes possible for some fetuses (see http://ehd.org/resources_bpd_documentation_english.php).

Axiom
annotated source: 21st week post-fertilization human stage
annotated property: definition
annotated target: Fetal stage when the fetus is over 20 and under 21 weeks of development.
database_cross_reference: Bgee:curator

22nd week post-fertilization human stage
type: Class
subclass of: human life cycle stage
subclass of: Restriction
  on property: part of
  some values from: sixth LMP month human stage
subclass of: Restriction
  on property: immediately_preceded_by
  some values from: 21st week post-fertilization human stage
definition: Fetal stage when the fetus is over 21 and under 22 weeks of development.
end, days post fertilization: 154.0
start, days post fertilization: 147.0
database_cross_reference: EV:0300022
has_obo_namespace: human_developmental_stage
id: HsapDv:0000059
in_subset: granular stage

Axiom
annotated source: 22nd week post-fertilization human stage
annotated property: definition
annotated target: Fetal stage when the fetus is over 21 and under 22 weeks of development.
database_cross_reference: Bgee:curator

23rd week post-fertilization human stage
type: Class
subclass of: human life cycle stage
subclass of: Restriction
  on property: part of
  some values from: sixth LMP month human stage
subclass of: Restriction
  on property: immediately_preceded_by
  some values from: 22nd week post-fertilization human stage
definition: Fetal stage when the fetus is over 22 and under 23 weeks of development.
end, days post fertilization: 161.0
start, days post fertilization: 154.0
database_cross_reference: EV:0300023
has_obo_namespace: human_developmental_stage
id: HsapDv:0000060
in_subset: granular stage

Axiom
annotated source: 23rd week post-fertilization human stage
annotated property: definition
annotated target: Fetal stage when the fetus is over 22 and under 23 weeks of development.
database_cross_reference: Bgee:curator

24th week post-fertilization human stage
type: Class
subclass of: human life cycle stage
subclass of: Restriction
  on property: part of
  some values from: sixth LMP month human stage
subclass of: Restriction
  on property: immediately_preceded_by
  some values from: 23rd week post-fertilization human stage
definition: Fetal stage when the fetus is over 23 and under 24 weeks of development.
end, days post fertilization: 168.0
start, days post fertilization: 161.0
database_cross_reference: EV:0300024
has_obo_namespace: human_developmental_stage
id: HsapDv:0000061
in_subset: granular stage
comment: The eyelids reopen (see http://ehd.org/resources_bpd_documentation_english.php).

Axiom
annotated source: 24th week post-fertilization human stage
annotated property: definition
annotated target: Fetal stage when the fetus is over 23 and under 24 weeks of development.
database_cross_reference: Bgee:curator

25th week post-fertilization human stage
type: Class
subclass of: human life cycle stage
subclass of: Restriction
  on property: part of
  some values from: seventh LMP month human stage
subclass of: Restriction
  on property: immediately_preceded_by
  some values from: 24th week post-fertilization human stage
definition: Fetal stage when the fetus is over 24 and under 25 weeks of development.
end, days post fertilization: 175.0
start, days post fertilization: 168.0
database_cross_reference: EV:0300032
has_obo_namespace: human_developmental_stage
id: HsapDv:0000062
in_subset: granular stage
comment: The assignation of this week to the seventh or sixth LMP month is debatable (see http://en.wikipedia.org/wiki/File:Prenatal_development_table.svg).

Axiom
annotated source: 25th week post-fertilization human stage
annotated property: subClassOf
annotated target: Restriction
  on property: part of
  some values from: seventh LMP month human stage
notes: debatable

Axiom
annotated source: 25th week post-fertilization human stage
annotated property: definition
annotated target: Fetal stage when the fetus is over 24 and under 25 weeks of development.
database_cross_reference: Bgee:curator

26th week post-fertilization human stage
type: Class
subclass of: human life cycle stage
subclass of: Restriction
  on property: part of
  some values from: seventh LMP month human stage
subclass of: Restriction
  on property: immediately_preceded_by
  some values from: 25th week post-fertilization human stage
definition: Fetal stage when the fetus is over 25 and under 26 weeks of development.
end, days post fertilization: 182.0
start, days post fertilization: 175.0
database_cross_reference: EV:0300025
has_obo_namespace: human_developmental_stage
id: HsapDv:0000063
in_subset: granular stage

Axiom
annotated source: 26th week post-fertilization human stage
annotated property: definition
annotated target: Fetal stage when the fetus is over 25 and under 26 weeks of development.
database_cross_reference: Bgee:curator

27th week post-fertilization human stage
type: Class
subclass of: human life cycle stage
subclass of: Restriction
  on property: part of
  some values from: seventh LMP month human stage
subclass of: Restriction
  on property: immediately_preceded_by
  some values from: 26th week post-fertilization human stage
definition: Fetal stage when the fetus is over 26 and under 27 weeks of development.
end, days post fertilization: 189.0
start, days post fertilization: 182.0
database_cross_reference: EV:0300033
has_obo_namespace: human_developmental_stage
id: HsapDv:0000064
in_subset: granular stage

Axiom
annotated source: 27th week post-fertilization human stage
annotated property: definition
annotated target: Fetal stage when the fetus is over 26 and under 27 weeks of development.
database_cross_reference: Bgee:curator

28th week post-fertilization human stage
type: Class
subclass of: human life cycle stage
subclass of: Restriction
  on property: part of
  some values from: seventh LMP month human stage
subclass of: Restriction
  on property: immediately_preceded_by
  some values from: 27th week post-fertilization human stage
definition: Fetal stage when the fetus is over 27 and under 28 weeks of development.
end, days post fertilization: 196.0
start, days post fertilization: 189.0
database_cross_reference: EV:0300026
has_obo_namespace: human_developmental_stage
id: HsapDv:0000065
in_subset: granular stage

Axiom
annotated source: 28th week post-fertilization human stage
annotated property: definition
annotated target: Fetal stage when the fetus is over 27 and under 28 weeks of development.
database_cross_reference: Bgee:curator

29th week post-fertilization human stage
type: Class
subclass of: human life cycle stage
subclass of: Restriction
  on property: part of
  some values from: eighth LMP month human stage
subclass of: Restriction
  on property: immediately_preceded_by
  some values from: 28th week post-fertilization human stage
definition: Fetal stage when the fetus is over 28 and under 29 weeks of development.
end, days post fertilization: 203.0
start, days post fertilization: 196.0
database_cross_reference: EV:0300034
has_obo_namespace: human_developmental_stage
id: HsapDv:0000066
in_subset: granular stage
comment: The assignation of this week to the eighth or seventh LMP month is debatable (see http://en.wikipedia.org/wiki/File:Prenatal_development_table.svg).

Axiom
annotated source: 29th week post-fertilization human stage
annotated property: subClassOf
annotated target: Restriction
  on property: part of
  some values from: eighth LMP month human stage
notes: debatable

Axiom
annotated source: 29th week post-fertilization human stage
annotated property: definition
annotated target: Fetal stage when the fetus is over 28 and under 29 weeks of development.
database_cross_reference: Bgee:curator

30th week post-fertilization human stage
type: Class
subclass of: human life cycle stage
subclass of: Restriction
  on property: part of
  some values from: eighth LMP month human stage
subclass of: Restriction
  on property: immediately_preceded_by
  some values from: 29th week post-fertilization human stage
definition: Fetal stage when the fetus is over 29 and under 30 weeks of development.
end, days post fertilization: 210.0
start, days post fertilization: 203.0
database_cross_reference: EV:0300035
has_obo_namespace: human_developmental_stage
id: HsapDv:0000067
in_subset: granular stage

Axiom
annotated source: 30th week post-fertilization human stage
annotated property: definition
annotated target: Fetal stage when the fetus is over 29 and under 30 weeks of development.
database_cross_reference: Bgee:curator

31st week post-fertilization human stage
type: Class
subclass of: human life cycle stage
subclass of: Restriction
  on property: part of
  some values from: eighth LMP month human stage
subclass of: Restriction
  on property: immediately_preceded_by
  some values from: 30th week post-fertilization human stage
definition: Fetal stage when the fetus is over 30 and under 31 weeks of development.
end, days post fertilization: 217.0
start, days post fertilization: 210.0
database_cross_reference: EV:0300036
has_obo_namespace: human_developmental_stage
id: HsapDv:0000068
in_subset: granular stage

Axiom
annotated source: 31st week post-fertilization human stage
annotated property: definition
annotated target: Fetal stage when the fetus is over 30 and under 31 weeks of development.
database_cross_reference: Bgee:curator

32nd week post-fertilization human stage
type: Class
subclass of: human life cycle stage
subclass of: Restriction
  on property: part of
  some values from: eighth LMP month human stage
subclass of: Restriction
  on property: immediately_preceded_by
  some values from: 31st week post-fertilization human stage
definition: Fetal stage when the fetus is over 31 and under 32 weeks of development.
end, days post fertilization: 224.0
start, days post fertilization: 217.0
database_cross_reference: EV:0300027
has_obo_namespace: human_developmental_stage
id: HsapDv:0000069
in_subset: granular stage

Axiom
annotated source: 32nd week post-fertilization human stage
annotated property: definition
annotated target: Fetal stage when the fetus is over 31 and under 32 weeks of development.
database_cross_reference: Bgee:curator

33rd week post-fertilization human stage
type: Class
subclass of: human life cycle stage
subclass of: Restriction
  on property: part of
  some values from: eighth LMP month human stage
subclass of: Restriction
  on property: immediately_preceded_by
  some values from: 32nd week post-fertilization human stage
definition: Fetal stage when the fetus is over 32 and under 33 weeks of development.
end, days post fertilization: 231.0
start, days post fertilization: 224.0
has_obo_namespace: human_developmental_stage
id: HsapDv:0000070
in_subset: granular stage
comment: The assignation of this week to the eighth or ninth LMP month is debatable (see http://en.wikipedia.org/wiki/File:Prenatal_development_table.svg).

Axiom
annotated source: 33rd week post-fertilization human stage
annotated property: subClassOf
annotated target: Restriction
  on property: part of
  some values from: eighth LMP month human stage
notes: debatable

Axiom
annotated source: 33rd week post-fertilization human stage
annotated property: definition
annotated target: Fetal stage when the fetus is over 32 and under 33 weeks of development.
database_cross_reference: Bgee:curator

34th week post-fertilization human stage
type: Class
subclass of: human life cycle stage
subclass of: Restriction
  on property: part of
  some values from: ninth LMP month human stage
subclass of: Restriction
  on property: immediately_preceded_by
  some values from: 33rd week post-fertilization human stage
definition: Fetal stage when the fetus is over 33 and under 34 weeks of development.
end, days post fertilization: 238.0
start, days post fertilization: 231.0
has_obo_namespace: human_developmental_stage
id: HsapDv:0000071
in_subset: granular stage

Axiom
annotated source: 34th week post-fertilization human stage
annotated property: definition
annotated target: Fetal stage when the fetus is over 33 and under 34 weeks of development.
database_cross_reference: Bgee:curator

35th week post-fertilization human stage
type: Class
subclass of: human life cycle stage
subclass of: Restriction
  on property: part of
  some values from: ninth LMP month human stage
subclass of: Restriction
  on property: immediately_preceded_by
  some values from: 34th week post-fertilization human stage
definition: Fetal stage when the fetus is over 34 and under 35 weeks of development.
end, days post fertilization: 245.0
start, days post fertilization: 238.0
has_obo_namespace: human_developmental_stage
id: HsapDv:0000072
in_subset: granular stage

Axiom
annotated source: 35th week post-fertilization human stage
annotated property: definition
annotated target: Fetal stage when the fetus is over 34 and under 35 weeks of development.
database_cross_reference: Bgee:curator

36th week post-fertilization human stage
type: Class
subclass of: human life cycle stage
subclass of: Restriction
  on property: part of
  some values from: ninth LMP month human stage
subclass of: Restriction
  on property: immediately_preceded_by
  some values from: 35th week post-fertilization human stage
definition: Fetal stage when the fetus is over 35 and under 36 weeks of development.
end, days post fertilization: 252.0
start, days post fertilization: 245.0
has_obo_namespace: human_developmental_stage
id: HsapDv:0000073
in_subset: granular stage

Axiom
annotated source: 36th week post-fertilization human stage
annotated property: definition
annotated target: Fetal stage when the fetus is over 35 and under 36 weeks of development.
database_cross_reference: Bgee:curator

37th week post-fertilization human stage
type: Class
subclass of: human life cycle stage
subclass of: Restriction
  on property: part of
  some values from: ninth LMP month human stage
subclass of: Restriction
  on property: immediately_preceded_by
  some values from: 36th week post-fertilization human stage
definition: Fetal stage when the fetus is over 36 and under 37 weeks of development.
end, days post fertilization: 259.0
start, days post fertilization: 252.0
has_obo_namespace: human_developmental_stage
id: HsapDv:0000074
in_subset: granular stage

Axiom
annotated source: 37th week post-fertilization human stage
annotated property: definition
annotated target: Fetal stage when the fetus is over 36 and under 37 weeks of development.
database_cross_reference: Bgee:curator

38th week post-fertilization and over human stage
type: Class
subclass of: human life cycle stage
subclass of: Restriction
  on property: part of
  some values from: ninth LMP month human stage
subclass of: Restriction
  on property: immediately_preceded_by
  some values from: 37th week post-fertilization human stage
definition: Fetal stage when the fetus is over 37 weeks of development and until birth.
end, days post fertilization: 266.0
start, days post fertilization: 259.0
has_obo_namespace: human_developmental_stage
id: HsapDv:0000075
comment: The assignation of this week to the ninth or tenth LMP month is debatable (see http://en.wikipedia.org/wiki/File:Prenatal_development_table.svg).

Axiom
annotated source: 38th week post-fertilization and over human stage
annotated property: subClassOf
annotated target: Restriction
  on property: part of
  some values from: ninth LMP month human stage
notes: debatable

Axiom
annotated source: 38th week post-fertilization and over human stage
annotated property: definition
annotated target: Fetal stage when the fetus is over 37 weeks of development and until birth.
database_cross_reference: Bgee:curator

immature stage
type: Class
subclass of: human life cycle stage
subclass of: Restriction
  on property: part of
  some values from: human life cycle
definition: Human developmental stage that covers the period from birth until 12 years old.
end, years post birth: 13.0
start, years post birth: 0.0
database_cross_reference: UBERON:0000112
has_exact_synonym: 0-12 years
has_obo_namespace: human_developmental_stage
has_related_synonym: child
id: HsapDv:0000080

Axiom
annotated source: immature stage
annotated property: definition
annotated target: Human developmental stage that covers the period from birth until 12 years old.
database_cross_reference: Bgee:curator

child stage
type: Class
subclass of: human life cycle stage
subclass of: Restriction
  on property: part of
  some values from: immature stage
subclass of: Restriction
  on property: immediately_preceded_by
  some values from: infant stage
definition: Immature stage that refers to child who is over 2 and under 13 years old.
end, years post birth: 13.0
start, years post birth: 2.0
has_exact_synonym: 2-12 years
has_obo_namespace: human_developmental_stage
id: HsapDv:0000081

Axiom
annotated source: child stage
annotated property: definition
annotated target: Immature stage that refers to child who is over 2 and under 13 years old.
database_cross_reference: Bgee:curator

newborn human stage
type: Class
subclass of: human life cycle stage
subclass of: Restriction
  on property: part of
  some values from: immature stage
definition: Immature stage that refers to a newborn who is under 32 days old.
end, months post birth: 1.0
end, years post birth: 0.083
start, months post birth: 0.0
start, years post birth: 0.0
has_exact_synonym: 0-1 month
has_obo_namespace: human_developmental_stage
has_related_synonym: neonatal stage
has_related_synonym: neonate
id: HsapDv:0000082

Axiom
annotated source: newborn human stage
annotated property: definition
annotated target: Immature stage that refers to a newborn who is under 32 days old.
database_cross_reference: Bgee:curator

infant stage
type: Class
subclass of: human life cycle stage
subclass of: Restriction
  on property: part of
  some values from: immature stage
subclass of: Restriction
  on property: immediately_preceded_by
  some values from: newborn human stage
definition: Immature stage that refers to an infant who is over 31 days and is under 24 months old.
end, months post birth: 24.0
end, years post birth: 2.0
start, months post birth: 1.0
start, years post birth: 0.083
has_exact_synonym: 1-23 months
has_exact_synonym: infantile stage
has_obo_namespace: human_developmental_stage
id: HsapDv:0000083

Axiom
annotated source: infant stage
annotated property: definition
annotated target: Immature stage that refers to an infant who is over 31 days and is under 24 months old.
database_cross_reference: Bgee:curator

2-5 year-old child stage
type: Class
subclass of: human life cycle stage
subclass of: Restriction
  on property: part of
  some values from: child stage
definition: Child stage that refers to a child who is over 24 months and under 6 years old.
end, years post birth: 6.0
start, years post birth: 2.0
has_obo_namespace: human_developmental_stage
has_related_synonym: preschool child
id: HsapDv:0000084

Axiom
annotated source: 2-5 year-old child stage
annotated property: definition
annotated target: Child stage that refers to a child who is over 24 months and under 6 years old.
database_cross_reference: Bgee:curator

6-12 year-old child stage
type: Class
subclass of: human life cycle stage
subclass of: Restriction
  on property: part of
  some values from: child stage
subclass of: Restriction
  on property: immediately_preceded_by
  some values from: 2-5 year-old child stage
definition: Child stage that refers to a child who is over 6 and under 13 years old.
end, years post birth: 13.0
start, years post birth: 6.0
has_obo_namespace: human_developmental_stage
has_related_synonym: prepubescent
id: HsapDv:0000085

Axiom
annotated source: 6-12 year-old child stage
annotated property: definition
annotated target: Child stage that refers to a child who is over 6 and under 13 years old.
database_cross_reference: Bgee:curator

adolescent stage
type: Class
subclass of: human life cycle stage
subclass of: Restriction
  on property: part of
  some values from: mature stage
definition: Mature stage that refers to an adolescent who is over 13 and under 19 years old.
end, years post birth: 19.0
start, years post birth: 13.0
has_exact_synonym: 13-18 years
has_obo_namespace: human_developmental_stage
has_related_synonym: teen
has_related_synonym: teenager
id: HsapDv:0000086

Axiom
annotated source: adolescent stage
annotated property: definition
annotated target: Mature stage that refers to an adolescent who is over 13 and under 19 years old.
database_cross_reference: Bgee:curator

human adult stage
type: Class
subclass of: human life cycle stage
subclass of: Restriction
  on property: part of
  some values from: mature stage
subclass of: Restriction
  on property: immediately_preceded_by
  some values from: adolescent stage
definition: Human developmental stage that refers to an adult who is over 19.
start, years post birth: 19.0
has_exact_synonym: 19+ years
has_obo_namespace: human_developmental_stage
id: HsapDv:0000087

Axiom
annotated source: human adult stage
annotated property: definition
annotated target: Human developmental stage that refers to an adult who is over 19.
database_cross_reference: Bgee:curator

human early adulthood stage
type: Class
subclass of: human life cycle stage
subclass of: Restriction
  on property: part of
  some values from: human adult stage
definition: Adult stage that refers to an adult who is under 45.
end, years post birth: 45.0
start, years post birth: 19.0
has_exact_synonym: 19-44 years
has_obo_namespace: human_developmental_stage
id: HsapDv:0000088

Axiom
annotated source: human early adulthood stage
annotated property: definition
annotated target: Adult stage that refers to an adult who is under 45.
database_cross_reference: Bgee:curator

young adult stage
type: Class
subclass of: human life cycle stage
subclass of: Restriction
  on property: part of
  some values from: human early adulthood stage
definition: Early adulthood that refers to an adult who is under 25.
end, years post birth: 25.0
start, years post birth: 19.0
has_exact_synonym: 19-24 years
has_obo_namespace: human_developmental_stage
id: HsapDv:0000089

Axiom
annotated source: young adult stage
annotated property: definition
annotated target: Early adulthood that refers to an adult who is under 25.
database_cross_reference: Bgee:curator

25-44 year-old human stage
type: Class
subclass of: human life cycle stage
subclass of: Restriction
  on property: part of
  some values from: human early adulthood stage
subclass of: Restriction
  on property: immediately_preceded_by
  some values from: young adult stage
definition: Early adulthood that refers to an adult who is over 25 and under 45.
end, years post birth: 45.0
start, years post birth: 25.0
has_obo_namespace: human_developmental_stage
id: HsapDv:0000090

Axiom
annotated source: 25-44 year-old human stage
annotated property: definition
annotated target: Early adulthood that refers to an adult who is over 25 and under 45.
database_cross_reference: Bgee:curator

human late adulthood stage
type: Class
subclass of: human life cycle stage
subclass of: Restriction
  on property: part of
  some values from: human adult stage
subclass of: Restriction
  on property: immediately_preceded_by
  some values from: human early adulthood stage
definition: Adult stage that refers to an adult who is over 45.
start, years post birth: 45.0
has_exact_synonym: 45+ years
has_obo_namespace: human_developmental_stage
has_related_synonym: Middle Aged + Aged
id: HsapDv:0000091

Axiom
annotated source: human late adulthood stage
annotated property: definition
annotated target: Adult stage that refers to an adult who is over 45.
database_cross_reference: Bgee:curator

human middle aged stage
type: Class
subclass of: human life cycle stage
subclass of: Restriction
  on property: part of
  some values from: human late adulthood stage
definition: Late adulthood that refers to an adult who is over 45 and under 65.
end, years post birth: 65.0
start, years post birth: 45.0
has_exact_synonym: 45-64 years
has_obo_namespace: human_developmental_stage
id: HsapDv:0000092

Axiom
annotated source: human middle aged stage
annotated property: definition
annotated target: Late adulthood that refers to an adult who is over 45 and under 65.
database_cross_reference: Bgee:curator

human aged stage
type: Class
subclass of: human life cycle stage
subclass of: Restriction
  on property: part of
  some values from: human late adulthood stage
subclass of: Restriction
  on property: immediately_preceded_by
  some values from: human middle aged stage
definition: Late adulthood that refers to an adult who is over 65.
start, years post birth: 65.0
database_cross_reference: UBERON:0007222
has_exact_synonym: 65+ years
has_obo_namespace: human_developmental_stage
has_related_synonym: elderly
id: HsapDv:0000093

Axiom
annotated source: human aged stage
annotated property: definition
annotated target: Late adulthood that refers to an adult who is over 65.
database_cross_reference: Bgee:curator

65-79 year-old human stage
type: Class
subclass of: human life cycle stage
subclass of: Restriction
  on property: part of
  some values from: human aged stage
definition: Aged stage that refers to an adult who is under 80.
end, years post birth: 80.0
start, years post birth: 65.0
has_obo_namespace: human_developmental_stage
has_related_synonym: elderly
id: HsapDv:0000094

Axiom
annotated source: 65-79 year-old human stage
annotated property: definition
annotated target: Aged stage that refers to an adult who is under 80.
database_cross_reference: Bgee:curator

80 year-old and over human stage
type: Class
subclass of: human life cycle stage
subclass of: Restriction
  on property: part of
  some values from: human aged stage
subclass of: Restriction
  on property: immediately_preceded_by
  some values from: 79-year-old human stage
definition: Aged stage that refers to an adult who is over 80.
start, years post birth: 80.0
has_obo_namespace: human_developmental_stage
id: HsapDv:0000095

Axiom
annotated source: 80 year-old and over human stage
annotated property: definition
annotated target: Aged stage that refers to an adult who is over 80.
database_cross_reference: Bgee:curator

2-year-old human stage
type: Class
subclass of: human life cycle stage
subclass of: Restriction
  on property: part of
  some values from: 2-5 year-old child stage
definition: Child stage that refers to a child who is over 2 and under 3 years old.
end, years post birth: 3.0
start, years post birth: 2.0
database_cross_reference: EV:0300053
has_obo_namespace: human_developmental_stage
id: HsapDv:0000096
in_subset: granular stage

Axiom
annotated source: 2-year-old human stage
annotated property: definition
annotated target: Child stage that refers to a child who is over 2 and under 3 years old.
database_cross_reference: Bgee:curator

3-year-old human stage
type: Class
subclass of: human life cycle stage
subclass of: Restriction
  on property: part of
  some values from: 2-5 year-old child stage
subclass of: Restriction
  on property: immediately_preceded_by
  some values from: 2-year-old human stage
definition: Child stage that refers to a child who is over 3 and under 4 years old.
end, years post birth: 4.0
start, years post birth: 3.0
database_cross_reference: EV:0300054
has_obo_namespace: human_developmental_stage
id: HsapDv:0000097
in_subset: granular stage

Axiom
annotated source: 3-year-old human stage
annotated property: definition
annotated target: Child stage that refers to a child who is over 3 and under 4 years old.
database_cross_reference: Bgee:curator

4-year-old human stage
type: Class
subclass of: human life cycle stage
subclass of: Restriction
  on property: part of
  some values from: 2-5 year-old child stage
subclass of: Restriction
  on property: immediately_preceded_by
  some values from: 3-year-old human stage
definition: Child stage that refers to a child who is over 4 and under 5 years old.
end, years post birth: 5.0
start, years post birth: 4.0
database_cross_reference: EV:0300055
has_obo_namespace: human_developmental_stage
id: HsapDv:0000098
in_subset: granular stage

Axiom
annotated source: 4-year-old human stage
annotated property: definition
annotated target: Child stage that refers to a child who is over 4 and under 5 years old.
database_cross_reference: Bgee:curator

5-year-old human stage
type: Class
subclass of: human life cycle stage
subclass of: Restriction
  on property: part of
  some values from: 2-5 year-old child stage
subclass of: Restriction
  on property: immediately_preceded_by
  some values from: 4-year-old human stage
definition: Child stage that refers to a child who is over 5 and under 6 years old.
end, years post birth: 6.0
start, years post birth: 5.0
database_cross_reference: EV:0300056
has_obo_namespace: human_developmental_stage
id: HsapDv:0000099
in_subset: granular stage

Axiom
annotated source: 5-year-old human stage
annotated property: definition
annotated target: Child stage that refers to a child who is over 5 and under 6 years old.
database_cross_reference: Bgee:curator

6-year-old human stage
type: Class
subclass of: human life cycle stage
subclass of: Restriction
  on property: part of
  some values from: 6-12 year-old child stage
subclass of: Restriction
  on property: immediately_preceded_by
  some values from: 5-year-old human stage
definition: Child stage that refers to a child who is over 6 and under 7 years old.
end, years post birth: 7.0
start, years post birth: 6.0
database_cross_reference: EV:0300057
has_obo_namespace: human_developmental_stage
id: HsapDv:0000100
in_subset: granular stage

Axiom
annotated source: 6-year-old human stage
annotated property: definition
annotated target: Child stage that refers to a child who is over 6 and under 7 years old.
database_cross_reference: Bgee:curator

7-year-old human stage
type: Class
subclass of: human life cycle stage
subclass of: Restriction
  on property: part of
  some values from: 6-12 year-old child stage
subclass of: Restriction
  on property: immediately_preceded_by
  some values from: 6-year-old human stage
definition: Child stage that refers to a child who is over 7 and under 8 years old.
end, years post birth: 8.0
start, years post birth: 7.0
database_cross_reference: EV:0300058
has_obo_namespace: human_developmental_stage
id: HsapDv:0000101
in_subset: granular stage

Axiom
annotated source: 7-year-old human stage
annotated property: definition
annotated target: Child stage that refers to a child who is over 7 and under 8 years old.
database_cross_reference: Bgee:curator

8-year-old human stage
type: Class
subclass of: human life cycle stage
subclass of: Restriction
  on property: part of
  some values from: 6-12 year-old child stage
subclass of: Restriction
  on property: immediately_preceded_by
  some values from: 7-year-old human stage
definition: Child stage that refers to a child who is over 8 and under 9 years old.
end, years post birth: 9.0
start, years post birth: 8.0
database_cross_reference: EV:0300059
has_obo_namespace: human_developmental_stage
id: HsapDv:0000102
in_subset: granular stage

Axiom
annotated source: 8-year-old human stage
annotated property: definition
annotated target: Child stage that refers to a child who is over 8 and under 9 years old.
database_cross_reference: Bgee:curator

9-year-old human stage
type: Class
subclass of: human life cycle stage
subclass of: Restriction
  on property: part of
  some values from: 6-12 year-old child stage
subclass of: Restriction
  on property: immediately_preceded_by
  some values from: 8-year-old human stage
definition: Child stage that refers to a child who is over 9 and under 10 years old.
end, years post birth: 10.0
start, years post birth: 9.0
database_cross_reference: EV:0300060
has_obo_namespace: human_developmental_stage
id: HsapDv:0000103
in_subset: granular stage

Axiom
annotated source: 9-year-old human stage
annotated property: definition
annotated target: Child stage that refers to a child who is over 9 and under 10 years old.
database_cross_reference: Bgee:curator

10-year-old human stage
type: Class
subclass of: human life cycle stage
subclass of: Restriction
  on property: part of
  some values from: 6-12 year-old child stage
subclass of: Restriction
  on property: immediately_preceded_by
  some values from: 9-year-old human stage
definition: Child stage that refers to a child who is over 10 and under 11 years old.
end, years post birth: 11.0
start, years post birth: 10.0
database_cross_reference: EV:0300061
has_obo_namespace: human_developmental_stage
id: HsapDv:0000104
in_subset: granular stage

Axiom
annotated source: 10-year-old human stage
annotated property: definition
annotated target: Child stage that refers to a child who is over 10 and under 11 years old.
database_cross_reference: Bgee:curator

11-year-old human stage
type: Class
subclass of: human life cycle stage
subclass of: Restriction
  on property: part of
  some values from: 6-12 year-old child stage
subclass of: Restriction
  on property: immediately_preceded_by
  some values from: 10-year-old human stage
definition: Child stage that refers to a child who is over 11 and under 12 years old.
end, years post birth: 12.0
start, years post birth: 11.0
database_cross_reference: EV:0300062
has_obo_namespace: human_developmental_stage
id: HsapDv:0000105
in_subset: granular stage

Axiom
annotated source: 11-year-old human stage
annotated property: definition
annotated target: Child stage that refers to a child who is over 11 and under 12 years old.
database_cross_reference: Bgee:curator

12-year-old human stage
type: Class
subclass of: human life cycle stage
subclass of: Restriction
  on property: part of
  some values from: 6-12 year-old child stage
subclass of: Restriction
  on property: immediately_preceded_by
  some values from: 11-year-old human stage
definition: Child stage that refers to a child who is over 12 and under 13 years old.
end, years post birth: 13.0
start, years post birth: 12.0
database_cross_reference: EV:0300063
has_obo_namespace: human_developmental_stage
id: HsapDv:0000106
in_subset: granular stage

Axiom
annotated source: 12-year-old human stage
annotated property: definition
annotated target: Child stage that refers to a child who is over 12 and under 13 years old.
database_cross_reference: Bgee:curator

13-year-old human stage
type: Class
subclass of: human life cycle stage
subclass of: Restriction
  on property: part of
  some values from: adolescent stage
subclass of: Restriction
  on property: immediately_preceded_by
  some values from: 12-year-old human stage
definition: Adolescent stage that refers to an adolescent who is over 13 and under 14 years old.
end, years post birth: 14.0
start, years post birth: 13.0
database_cross_reference: EV:0300065
has_obo_namespace: human_developmental_stage
id: HsapDv:0000107
in_subset: granular stage

Axiom
annotated source: 13-year-old human stage
annotated property: definition
annotated target: Adolescent stage that refers to an adolescent who is over 13 and under 14 years old.
database_cross_reference: Bgee:curator

14-year-old human stage
type: Class
subclass of: human life cycle stage
subclass of: Restriction
  on property: part of
  some values from: adolescent stage
subclass of: Restriction
  on property: immediately_preceded_by
  some values from: 13-year-old human stage
definition: Adolescent stage that refers to an adolescent who is over 14 and under 15 years old.
end, years post birth: 15.0
start, years post birth: 14.0
database_cross_reference: EV:0300066
has_obo_namespace: human_developmental_stage
id: HsapDv:0000108
in_subset: granular stage

Axiom
annotated source: 14-year-old human stage
annotated property: definition
annotated target: Adolescent stage that refers to an adolescent who is over 14 and under 15 years old.
database_cross_reference: Bgee:curator

15-year-old human stage
type: Class
subclass of: human life cycle stage
subclass of: Restriction
  on property: part of
  some values from: adolescent stage
subclass of: Restriction
  on property: immediately_preceded_by
  some values from: 14-year-old human stage
definition: Adolescent stage that refers to an adolescent who is over 15 and under 16 years old.
end, years post birth: 16.0
start, years post birth: 15.0
database_cross_reference: EV:0300067
has_obo_namespace: human_developmental_stage
id: HsapDv:0000109
in_subset: granular stage

Axiom
annotated source: 15-year-old human stage
annotated property: definition
annotated target: Adolescent stage that refers to an adolescent who is over 15 and under 16 years old.
database_cross_reference: Bgee:curator

16-year-old human stage
type: Class
subclass of: human life cycle stage
subclass of: Restriction
  on property: part of
  some values from: adolescent stage
subclass of: Restriction
  on property: immediately_preceded_by
  some values from: 15-year-old human stage
definition: Adolescent stage that refers to an adolescent who is over 16 and under 17 years old.
end, years post birth: 17.0
start, years post birth: 16.0
database_cross_reference: EV:0300068
has_obo_namespace: human_developmental_stage
id: HsapDv:0000110
in_subset: granular stage

Axiom
annotated source: 16-year-old human stage
annotated property: definition
annotated target: Adolescent stage that refers to an adolescent who is over 16 and under 17 years old.
database_cross_reference: Bgee:curator

17-year-old human stage
type: Class
subclass of: human life cycle stage
subclass of: Restriction
  on property: part of
  some values from: adolescent stage
subclass of: Restriction
  on property: immediately_preceded_by
  some values from: 16-year-old human stage
definition: Adolescent stage that refers to an adolescent who is over 17 and under 18 years old.
end, years post birth: 18.0
start, years post birth: 17.0
database_cross_reference: EV:0300069
has_obo_namespace: human_developmental_stage
id: HsapDv:0000111
in_subset: granular stage

Axiom
annotated source: 17-year-old human stage
annotated property: definition
annotated target: Adolescent stage that refers to an adolescent who is over 17 and under 18 years old.
database_cross_reference: Bgee:curator

18-year-old human stage
type: Class
subclass of: human life cycle stage
subclass of: Restriction
  on property: part of
  some values from: adolescent stage
subclass of: Restriction
  on property: immediately_preceded_by
  some values from: 17-year-old human stage
definition: Adolescent stage that refers to an adolescent who is over 18 and under 19 years old.
end, years post birth: 19.0
start, years post birth: 18.0
database_cross_reference: EV:0300071
has_obo_namespace: human_developmental_stage
id: HsapDv:0000112
in_subset: granular stage

Axiom
annotated source: 18-year-old human stage
annotated property: definition
annotated target: Adolescent stage that refers to an adolescent who is over 18 and under 19 years old.
database_cross_reference: Bgee:curator

19-year-old human stage
type: Class
subclass of: human life cycle stage
subclass of: Restriction
  on property: part of
  some values from: young adult stage
subclass of: Restriction
  on property: immediately_preceded_by
  some values from: 18-year-old human stage
definition: Young adult stage that refers to an adult who is under 20.
end, years post birth: 20.0
start, years post birth: 19.0
database_cross_reference: EV:0300072
has_obo_namespace: human_developmental_stage
id: HsapDv:0000113
in_subset: granular stage

Axiom
annotated source: 19-year-old human stage
annotated property: definition
annotated target: Young adult stage that refers to an adult who is under 20.
database_cross_reference: Bgee:curator

20-year-old human stage
type: Class
subclass of: human life cycle stage
subclass of: Restriction
  on property: part of
  some values from: young adult stage
subclass of: Restriction
  on property: immediately_preceded_by
  some values from: 19-year-old human stage
definition: Young adult stage that refers to an adult who is over 20 and under 21.
end, years post birth: 21.0
start, years post birth: 20.0
database_cross_reference: EV:0300073
has_obo_namespace: human_developmental_stage
id: HsapDv:0000114
in_subset: granular stage

Axiom
annotated source: 20-year-old human stage
annotated property: definition
annotated target: Young adult stage that refers to an adult who is over 20 and under 21.
database_cross_reference: Bgee:curator

21-year-old human stage
type: Class
subclass of: human life cycle stage
subclass of: Restriction
  on property: part of
  some values from: young adult stage
subclass of: Restriction
  on property: immediately_preceded_by
  some values from: 20-year-old human stage
definition: Young adult stage that refers to an adult who is over 21 and under 22.
end, years post birth: 22.0
start, years post birth: 21.0
database_cross_reference: EV:0300074
has_obo_namespace: human_developmental_stage
id: HsapDv:0000115
in_subset: granular stage

Axiom
annotated source: 21-year-old human stage
annotated property: definition
annotated target: Young adult stage that refers to an adult who is over 21 and under 22.
database_cross_reference: Bgee:curator

22-year-old human stage
type: Class
subclass of: human life cycle stage
subclass of: Restriction
  on property: part of
  some values from: young adult stage
subclass of: Restriction
  on property: immediately_preceded_by
  some values from: 21-year-old human stage
definition: Young adult stage that refers to an adult who is over 22 and under 23.
end, years post birth: 23.0
start, years post birth: 22.0
database_cross_reference: EV:0300075
has_obo_namespace: human_developmental_stage
id: HsapDv:0000116
in_subset: granular stage

Axiom
annotated source: 22-year-old human stage
annotated property: definition
annotated target: Young adult stage that refers to an adult who is over 22 and under 23.
database_cross_reference: Bgee:curator

23-year-old human stage
type: Class
subclass of: human life cycle stage
subclass of: Restriction
  on property: part of
  some values from: young adult stage
subclass of: Restriction
  on property: immediately_preceded_by
  some values from: 22-year-old human stage
definition: Young adult stage that refers to an adult who is over 23 and under 24.
end, years post birth: 24.0
start, years post birth: 23.0
database_cross_reference: EV:0300076
has_obo_namespace: human_developmental_stage
id: HsapDv:0000117
in_subset: granular stage

Axiom
annotated source: 23-year-old human stage
annotated property: definition
annotated target: Young adult stage that refers to an adult who is over 23 and under 24.
database_cross_reference: Bgee:curator

24-year-old human stage
type: Class
subclass of: human life cycle stage
subclass of: Restriction
  on property: part of
  some values from: young adult stage
subclass of: Restriction
  on property: immediately_preceded_by
  some values from: 23-year-old human stage
definition: Young adult stage that refers to an adult who is over 24 and under 25.
end, years post birth: 25.0
start, years post birth: 24.0
database_cross_reference: EV:0300077
has_obo_namespace: human_developmental_stage
id: HsapDv:0000118
in_subset: granular stage

Axiom
annotated source: 24-year-old human stage
annotated property: definition
annotated target: Young adult stage that refers to an adult who is over 24 and under 25.
database_cross_reference: Bgee:curator

25-year-old human stage
type: Class
subclass of: human life cycle stage
subclass of: Restriction
  on property: part of
  some values from: 25-44 year-old human stage
subclass of: Restriction
  on property: immediately_preceded_by
  some values from: 24-year-old human stage
definition: Adult stage that refers to an adult who is over 25 and under 26.
end, years post birth: 26.0
start, years post birth: 25.0
database_cross_reference: EV:0300078
has_obo_namespace: human_developmental_stage
id: HsapDv:0000119
in_subset: granular stage

Axiom
annotated source: 25-year-old human stage
annotated property: definition
annotated target: Adult stage that refers to an adult who is over 25 and under 26.
database_cross_reference: Bgee:curator

26-year-old human stage
type: Class
subclass of: human life cycle stage
subclass of: Restriction
  on property: part of
  some values from: 25-44 year-old human stage
subclass of: Restriction
  on property: immediately_preceded_by
  some values from: 25-year-old human stage
definition: Adult stage that refers to an adultwho is over 26 and under 27.
end, years post birth: 27.0
start, years post birth: 26.0
database_cross_reference: EV:0300079
has_obo_namespace: human_developmental_stage
id: HsapDv:0000120
in_subset: granular stage

Axiom
annotated source: 26-year-old human stage
annotated property: definition
annotated target: Adult stage that refers to an adultwho is over 26 and under 27.
database_cross_reference: Bgee:curator

27-year-old human stage
type: Class
subclass of: human life cycle stage
subclass of: Restriction
  on property: part of
  some values from: 25-44 year-old human stage
subclass of: Restriction
  on property: immediately_preceded_by
  some values from: 26-year-old human stage
definition: Adult stage that refers to an adult who is over 27 and under 28.
end, years post birth: 28.0
start, years post birth: 27.0
database_cross_reference: EV:0300080
has_obo_namespace: human_developmental_stage
id: HsapDv:0000121
in_subset: granular stage

Axiom
annotated source: 27-year-old human stage
annotated property: definition
annotated target: Adult stage that refers to an adult who is over 27 and under 28.
database_cross_reference: Bgee:curator

28-year-old human stage
type: Class
subclass of: human life cycle stage
subclass of: Restriction
  on property: part of
  some values from: 25-44 year-old human stage
subclass of: Restriction
  on property: immediately_preceded_by
  some values from: 27-year-old human stage
definition: Adult stage that refers to an adult who is over 28 and under 29.
end, years post birth: 29.0
start, years post birth: 28.0
database_cross_reference: EV:0300081
has_obo_namespace: human_developmental_stage
id: HsapDv:0000122
in_subset: granular stage

Axiom
annotated source: 28-year-old human stage
annotated property: definition
annotated target: Adult stage that refers to an adult who is over 28 and under 29.
database_cross_reference: Bgee:curator

29-year-old human stage
type: Class
subclass of: human life cycle stage
subclass of: Restriction
  on property: part of
  some values from: 25-44 year-old human stage
subclass of: Restriction
  on property: immediately_preceded_by
  some values from: 28-year-old human stage
definition: Adult stage that refers to an adult who is over 29 and under 30.
end, years post birth: 30.0
start, years post birth: 29.0
database_cross_reference: EV:0300082
has_obo_namespace: human_developmental_stage
id: HsapDv:0000123
in_subset: granular stage

Axiom
annotated source: 29-year-old human stage
annotated property: definition
annotated target: Adult stage that refers to an adult who is over 29 and under 30.
database_cross_reference: Bgee:curator

30-year-old human stage
type: Class
subclass of: human life cycle stage
subclass of: Restriction
  on property: part of
  some values from: 25-44 year-old human stage
subclass of: Restriction
  on property: immediately_preceded_by
  some values from: 29-year-old human stage
definition: Adult stage that refers to an adult who is over 30 and under 31.
end, years post birth: 31.0
start, years post birth: 30.0
database_cross_reference: EV:0300083
has_obo_namespace: human_developmental_stage
id: HsapDv:0000124
in_subset: granular stage

Axiom
annotated source: 30-year-old human stage
annotated property: definition
annotated target: Adult stage that refers to an adult who is over 30 and under 31.
database_cross_reference: Bgee:curator

31-year-old human stage
type: Class
subclass of: human life cycle stage
subclass of: Restriction
  on property: part of
  some values from: 25-44 year-old human stage
subclass of: Restriction
  on property: immediately_preceded_by
  some values from: 30-year-old human stage
definition: Adult stage that refers to an adult who is over 31 and under 32.
end, years post birth: 32.0
start, years post birth: 31.0
database_cross_reference: EV:0300084
has_obo_namespace: human_developmental_stage
id: HsapDv:0000125
in_subset: granular stage

Axiom
annotated source: 31-year-old human stage
annotated property: definition
annotated target: Adult stage that refers to an adult who is over 31 and under 32.
database_cross_reference: Bgee:curator

32-year-old human stage
type: Class
subclass of: human life cycle stage
subclass of: Restriction
  on property: part of
  some values from: 25-44 year-old human stage
subclass of: Restriction
  on property: immediately_preceded_by
  some values from: 31-year-old human stage
definition: Adult stage that refers to an adult who is over 32 and under 33.
end, years post birth: 33.0
start, years post birth: 32.0
database_cross_reference: EV:0300085
has_obo_namespace: human_developmental_stage
id: HsapDv:0000126
in_subset: granular stage

Axiom
annotated source: 32-year-old human stage
annotated property: definition
annotated target: Adult stage that refers to an adult who is over 32 and under 33.
database_cross_reference: Bgee:curator

33-year-old human stage
type: Class
subclass of: human life cycle stage
subclass of: Restriction
  on property: part of
  some values from: 25-44 year-old human stage
subclass of: Restriction
  on property: immediately_preceded_by
  some values from: 32-year-old human stage
definition: Adult stage that refers to an adult who is over 33 and under 34.
end, years post birth: 34.0
start, years post birth: 33.0
database_cross_reference: EV:0300086
has_obo_namespace: human_developmental_stage
id: HsapDv:0000127
in_subset: granular stage

Axiom
annotated source: 33-year-old human stage
annotated property: definition
annotated target: Adult stage that refers to an adult who is over 33 and under 34.
database_cross_reference: Bgee:curator

34-year-old human stage
type: Class
subclass of: human life cycle stage
subclass of: Restriction
  on property: part of
  some values from: 25-44 year-old human stage
subclass of: Restriction
  on property: immediately_preceded_by
  some values from: 33-year-old human stage
definition: Adult stage that refers to an adult who is over 34 and under 35.
end, years post birth: 35.0
start, years post birth: 34.0
database_cross_reference: EV:0300087
has_obo_namespace: human_developmental_stage
id: HsapDv:0000128
in_subset: granular stage

Axiom
annotated source: 34-year-old human stage
annotated property: definition
annotated target: Adult stage that refers to an adult who is over 34 and under 35.
database_cross_reference: Bgee:curator

35-year-old human stage
type: Class
subclass of: human life cycle stage
subclass of: Restriction
  on property: part of
  some values from: 25-44 year-old human stage
subclass of: Restriction
  on property: immediately_preceded_by
  some values from: 34-year-old human stage
definition: Adult stage that refers to an adult who is over 35 and under 36.
end, years post birth: 36.0
start, years post birth: 35.0
database_cross_reference: EV:0300088
has_obo_namespace: human_developmental_stage
id: HsapDv:0000129
in_subset: granular stage

Axiom
annotated source: 35-year-old human stage
annotated property: definition
annotated target: Adult stage that refers to an adult who is over 35 and under 36.
database_cross_reference: Bgee:curator

36-year-old human stage
type: Class
subclass of: human life cycle stage
subclass of: Restriction
  on property: part of
  some values from: 25-44 year-old human stage
subclass of: Restriction
  on property: immediately_preceded_by
  some values from: 35-year-old human stage
definition: Adult stage that refers to an adult who is over 36 and under 37.
end, years post birth: 37.0
start, years post birth: 36.0
database_cross_reference: EV:0300089
has_obo_namespace: human_developmental_stage
id: HsapDv:0000130
in_subset: granular stage

Axiom
annotated source: 36-year-old human stage
annotated property: definition
annotated target: Adult stage that refers to an adult who is over 36 and under 37.
database_cross_reference: Bgee:curator

37-year-old human stage
type: Class
subclass of: human life cycle stage
subclass of: Restriction
  on property: part of
  some values from: 25-44 year-old human stage
subclass of: Restriction
  on property: immediately_preceded_by
  some values from: 36-year-old human stage
definition: Adult stage that refers to an adult who is over 37 and under 38.
end, years post birth: 38.0
start, years post birth: 37.0
database_cross_reference: EV:0300090
has_obo_namespace: human_developmental_stage
id: HsapDv:0000131
in_subset: granular stage

Axiom
annotated source: 37-year-old human stage
annotated property: definition
annotated target: Adult stage that refers to an adult who is over 37 and under 38.
database_cross_reference: Bgee:curator

38-year-old human stage
type: Class
subclass of: human life cycle stage
subclass of: Restriction
  on property: part of
  some values from: 25-44 year-old human stage
subclass of: Restriction
  on property: immediately_preceded_by
  some values from: 37-year-old human stage
definition: Adult stage that refers to an adult who is over 38 and under 39.
end, years post birth: 39.0
start, years post birth: 38.0
database_cross_reference: EV:0300091
has_obo_namespace: human_developmental_stage
id: HsapDv:0000132
in_subset: granular stage

Axiom
annotated source: 38-year-old human stage
annotated property: definition
annotated target: Adult stage that refers to an adult who is over 38 and under 39.
database_cross_reference: Bgee:curator

39-year-old human stage
type: Class
subclass of: human life cycle stage
subclass of: Restriction
  on property: part of
  some values from: 25-44 year-old human stage
subclass of: Restriction
  on property: immediately_preceded_by
  some values from: 38-year-old human stage
definition: Adult stage that refers to an adult who is over 39 and under 40.
end, years post birth: 40.0
start, years post birth: 39.0
database_cross_reference: EV:0300092
has_obo_namespace: human_developmental_stage
id: HsapDv:0000133
in_subset: granular stage

Axiom
annotated source: 39-year-old human stage
annotated property: definition
annotated target: Adult stage that refers to an adult who is over 39 and under 40.
database_cross_reference: Bgee:curator

40-year-old human stage
type: Class
subclass of: human life cycle stage
subclass of: Restriction
  on property: part of
  some values from: 25-44 year-old human stage
subclass of: Restriction
  on property: immediately_preceded_by
  some values from: 39-year-old human stage
definition: Adult stage that refers to an adult who is over 40 and under 41.
end, years post birth: 41.0
start, years post birth: 40.0
database_cross_reference: EV:0300093
has_obo_namespace: human_developmental_stage
id: HsapDv:0000134
in_subset: granular stage

Axiom
annotated source: 40-year-old human stage
annotated property: definition
annotated target: Adult stage that refers to an adult who is over 40 and under 41.
database_cross_reference: Bgee:curator

41-year-old human stage
type: Class
subclass of: human life cycle stage
subclass of: Restriction
  on property: part of
  some values from: 25-44 year-old human stage
subclass of: Restriction
  on property: immediately_preceded_by
  some values from: 40-year-old human stage
definition: Adult stage that refers to an adult who is over 41 and under 42.
end, years post birth: 42.0
start, years post birth: 41.0
database_cross_reference: EV:0300094
has_obo_namespace: human_developmental_stage
id: HsapDv:0000135
in_subset: granular stage

Axiom
annotated source: 41-year-old human stage
annotated property: definition
annotated target: Adult stage that refers to an adult who is over 41 and under 42.
database_cross_reference: Bgee:curator

42-year-old human stage
type: Class
subclass of: human life cycle stage
subclass of: Restriction
  on property: part of
  some values from: 25-44 year-old human stage
subclass of: Restriction
  on property: immediately_preceded_by
  some values from: 41-year-old human stage
definition: Adult stage that refers to an adult who is over 42 and under 43.
end, years post birth: 43.0
start, years post birth: 42.0
database_cross_reference: EV:0300095
has_obo_namespace: human_developmental_stage
id: HsapDv:0000136
in_subset: granular stage

Axiom
annotated source: 42-year-old human stage
annotated property: definition
annotated target: Adult stage that refers to an adult who is over 42 and under 43.
database_cross_reference: Bgee:curator

43-year-old human stage
type: Class
subclass of: human life cycle stage
subclass of: Restriction
  on property: part of
  some values from: 25-44 year-old human stage
subclass of: Restriction
  on property: immediately_preceded_by
  some values from: 42-year-old human stage
definition: Adult stage that refers to an adult who is over 43 and under 44.
end, years post birth: 44.0
start, years post birth: 43.0
database_cross_reference: EV:0300096
has_obo_namespace: human_developmental_stage
id: HsapDv:0000137
in_subset: granular stage

Axiom
annotated source: 43-year-old human stage
annotated property: definition
annotated target: Adult stage that refers to an adult who is over 43 and under 44.
database_cross_reference: Bgee:curator

44-year-old human stage
type: Class
subclass of: human life cycle stage
subclass of: Restriction
  on property: part of
  some values from: 25-44 year-old human stage
subclass of: Restriction
  on property: immediately_preceded_by
  some values from: 43-year-old human stage
definition: Adult stage that refers to an adult who is over 44 and under 45.
end, years post birth: 45.0
start, years post birth: 44.0
database_cross_reference: EV:0300097
has_obo_namespace: human_developmental_stage
id: HsapDv:0000138
in_subset: granular stage

Axiom
annotated source: 44-year-old human stage
annotated property: definition
annotated target: Adult stage that refers to an adult who is over 44 and under 45.
database_cross_reference: Bgee:curator

45-year-old human stage
type: Class
subclass of: human life cycle stage
subclass of: Restriction
  on property: part of
  some values from: human middle aged stage
subclass of: Restriction
  on property: immediately_preceded_by
  some values from: 44-year-old human stage
definition: Middle aged stage that refers to an adult who is over 45 and under 46.
end, years post birth: 46.0
start, years post birth: 45.0
database_cross_reference: EV:0300098
has_obo_namespace: human_developmental_stage
id: HsapDv:0000139
in_subset: granular stage

Axiom
annotated source: 45-year-old human stage
annotated property: definition
annotated target: Middle aged stage that refers to an adult who is over 45 and under 46.
database_cross_reference: Bgee:curator

46-year-old human stage
type: Class
subclass of: human life cycle stage
subclass of: Restriction
  on property: part of
  some values from: human middle aged stage
subclass of: Restriction
  on property: immediately_preceded_by
  some values from: 45-year-old human stage
definition: Middle aged stage that refers to an adult who is over 46 and under 47.
end, years post birth: 47.0
start, years post birth: 46.0
database_cross_reference: EV:0300099
has_obo_namespace: human_developmental_stage
id: HsapDv:0000140
in_subset: granular stage

Axiom
annotated source: 46-year-old human stage
annotated property: definition
annotated target: Middle aged stage that refers to an adult who is over 46 and under 47.
database_cross_reference: Bgee:curator

47-year-old human stage
type: Class
subclass of: human life cycle stage
subclass of: Restriction
  on property: part of
  some values from: human middle aged stage
subclass of: Restriction
  on property: immediately_preceded_by
  some values from: 46-year-old human stage
definition: Middle aged stage that refers to an adult who is over 47 and under 48.
end, years post birth: 48.0
start, years post birth: 47.0
database_cross_reference: EV:0300100
has_obo_namespace: human_developmental_stage
id: HsapDv:0000141
in_subset: granular stage

Axiom
annotated source: 47-year-old human stage
annotated property: definition
annotated target: Middle aged stage that refers to an adult who is over 47 and under 48.
database_cross_reference: Bgee:curator

48-year-old human stage
type: Class
subclass of: human life cycle stage
subclass of: Restriction
  on property: part of
  some values from: human middle aged stage
subclass of: Restriction
  on property: immediately_preceded_by
  some values from: 47-year-old human stage
definition: Middle aged stage that refers to an adult who is over 48 and under 49.
end, years post birth: 49.0
start, years post birth: 48.0
database_cross_reference: EV:0300101
has_obo_namespace: human_developmental_stage
id: HsapDv:0000142
in_subset: granular stage

Axiom
annotated source: 48-year-old human stage
annotated property: definition
annotated target: Middle aged stage that refers to an adult who is over 48 and under 49.
database_cross_reference: Bgee:curator

49-year-old human stage
type: Class
subclass of: human life cycle stage
subclass of: Restriction
  on property: part of
  some values from: human middle aged stage
subclass of: Restriction
  on property: immediately_preceded_by
  some values from: 48-year-old human stage
definition: Middle aged stage that refers to an adult who is over 49 and under 50.
end, years post birth: 50.0
start, years post birth: 49.0
database_cross_reference: EV:0300102
has_obo_namespace: human_developmental_stage
id: HsapDv:0000143
in_subset: granular stage

Axiom
annotated source: 49-year-old human stage
annotated property: definition
annotated target: Middle aged stage that refers to an adult who is over 49 and under 50.
database_cross_reference: Bgee:curator

50-year-old human stage
type: Class
subclass of: human life cycle stage
subclass of: Restriction
  on property: part of
  some values from: human middle aged stage
subclass of: Restriction
  on property: immediately_preceded_by
  some values from: 49-year-old human stage
definition: Middle aged stage that refers to an adult who is over 50 and under 51.
end, years post birth: 51.0
start, years post birth: 50.0
database_cross_reference: EV:0300103
has_obo_namespace: human_developmental_stage
id: HsapDv:0000144
in_subset: granular stage

Axiom
annotated source: 50-year-old human stage
annotated property: definition
annotated target: Middle aged stage that refers to an adult who is over 50 and under 51.
database_cross_reference: Bgee:curator

51-year-old human stage
type: Class
subclass of: human life cycle stage
subclass of: Restriction
  on property: part of
  some values from: human middle aged stage
subclass of: Restriction
  on property: immediately_preceded_by
  some values from: 50-year-old human stage
definition: Middle aged stage that refers to an adult who is over 51 and under 52.
end, years post birth: 52.0
start, years post birth: 51.0
database_cross_reference: EV:0300104
has_obo_namespace: human_developmental_stage
id: HsapDv:0000145
in_subset: granular stage

Axiom
annotated source: 51-year-old human stage
annotated property: definition
annotated target: Middle aged stage that refers to an adult who is over 51 and under 52.
database_cross_reference: Bgee:curator

52-year-old human stage
type: Class
subclass of: human life cycle stage
subclass of: Restriction
  on property: part of
  some values from: human middle aged stage
subclass of: Restriction
  on property: immediately_preceded_by
  some values from: 51-year-old human stage
definition: Middle aged stage that refers to an adult who is over 52 and under 53.
end, years post birth: 53.0
start, years post birth: 52.0
database_cross_reference: EV:0300105
has_obo_namespace: human_developmental_stage
id: HsapDv:0000146
in_subset: granular stage

Axiom
annotated source: 52-year-old human stage
annotated property: definition
annotated target: Middle aged stage that refers to an adult who is over 52 and under 53.
database_cross_reference: Bgee:curator

53-year-old human stage
type: Class
subclass of: human life cycle stage
subclass of: Restriction
  on property: part of
  some values from: human middle aged stage
subclass of: Restriction
  on property: immediately_preceded_by
  some values from: 52-year-old human stage
definition: Middle aged stage that refers to an adult who is over 53 and under 54.
end, years post birth: 54.0
start, years post birth: 53.0
database_cross_reference: EV:0300106
has_obo_namespace: human_developmental_stage
id: HsapDv:0000147
in_subset: granular stage

Axiom
annotated source: 53-year-old human stage
annotated property: definition
annotated target: Middle aged stage that refers to an adult who is over 53 and under 54.
database_cross_reference: Bgee:curator

54-year-old human stage
type: Class
subclass of: human life cycle stage
subclass of: Restriction
  on property: part of
  some values from: human middle aged stage
subclass of: Restriction
  on property: immediately_preceded_by
  some values from: 53-year-old human stage
definition: Middle aged stage that refers to an adult who is over 54 and under 55.
end, years post birth: 55.0
start, years post birth: 54.0
database_cross_reference: EV:0300107
has_obo_namespace: human_developmental_stage
id: HsapDv:0000148
in_subset: granular stage

Axiom
annotated source: 54-year-old human stage
annotated property: definition
annotated target: Middle aged stage that refers to an adult who is over 54 and under 55.
database_cross_reference: Bgee:curator

55-year-old human stage
type: Class
subclass of: human life cycle stage
subclass of: Restriction
  on property: part of
  some values from: human middle aged stage
subclass of: Restriction
  on property: immediately_preceded_by
  some values from: 54-year-old human stage
definition: Middle aged stage that refers to an adult who is over 55 and under 56.
end, years post birth: 56.0
start, years post birth: 55.0
database_cross_reference: EV:0300108
has_obo_namespace: human_developmental_stage
id: HsapDv:0000149
in_subset: granular stage

Axiom
annotated source: 55-year-old human stage
annotated property: definition
annotated target: Middle aged stage that refers to an adult who is over 55 and under 56.
database_cross_reference: Bgee:curator

56-year-old human stage
type: Class
subclass of: human life cycle stage
subclass of: Restriction
  on property: part of
  some values from: human middle aged stage
subclass of: Restriction
  on property: immediately_preceded_by
  some values from: 55-year-old human stage
definition: Middle aged stage that refers to an adult who is over 56 and under 57.
end, years post birth: 57.0
start, years post birth: 56.0
database_cross_reference: EV:0300109
has_obo_namespace: human_developmental_stage
id: HsapDv:0000150
in_subset: granular stage

Axiom
annotated source: 56-year-old human stage
annotated property: definition
annotated target: Middle aged stage that refers to an adult who is over 56 and under 57.
database_cross_reference: Bgee:curator

57-year-old human stage
type: Class
subclass of: human life cycle stage
subclass of: Restriction
  on property: part of
  some values from: human middle aged stage
subclass of: Restriction
  on property: immediately_preceded_by
  some values from: 56-year-old human stage
definition: Middle aged stage that refers to an adult who is over 57 and under 58.
end, years post birth: 58.0
start, years post birth: 57.0
database_cross_reference: EV:0300110
has_obo_namespace: human_developmental_stage
id: HsapDv:0000151
in_subset: granular stage

Axiom
annotated source: 57-year-old human stage
annotated property: definition
annotated target: Middle aged stage that refers to an adult who is over 57 and under 58.
database_cross_reference: Bgee:curator

58-year-old human stage
type: Class
subclass of: human life cycle stage
subclass of: Restriction
  on property: part of
  some values from: human middle aged stage
subclass of: Restriction
  on property: immediately_preceded_by
  some values from: 57-year-old human stage
definition: Middle aged stage that refers to an adult who is over 58 and under 59.
end, years post birth: 59.0
start, years post birth: 58.0
database_cross_reference: EV:0300111
has_obo_namespace: human_developmental_stage
id: HsapDv:0000152
in_subset: granular stage

Axiom
annotated source: 58-year-old human stage
annotated property: definition
annotated target: Middle aged stage that refers to an adult who is over 58 and under 59.
database_cross_reference: Bgee:curator

59-year-old human stage
type: Class
subclass of: human life cycle stage
subclass of: Restriction
  on property: part of
  some values from: human middle aged stage
subclass of: Restriction
  on property: immediately_preceded_by
  some values from: 58-year-old human stage
definition: Middle aged stage that refers to an adult who is over 59 and under 60.
end, years post birth: 60.0
start, years post birth: 59.0
database_cross_reference: EV:0300112
has_obo_namespace: human_developmental_stage
id: HsapDv:0000153
in_subset: granular stage

Axiom
annotated source: 59-year-old human stage
annotated property: definition
annotated target: Middle aged stage that refers to an adult who is over 59 and under 60.
database_cross_reference: Bgee:curator

60-year-old human stage
type: Class
subclass of: human life cycle stage
subclass of: Restriction
  on property: part of
  some values from: human middle aged stage
subclass of: Restriction
  on property: immediately_preceded_by
  some values from: 59-year-old human stage
definition: Middle aged stage that refers to an adult who is over 60 and under 61.
end, years post birth: 61.0
start, years post birth: 60.0
database_cross_reference: EV:0300113
has_obo_namespace: human_developmental_stage
id: HsapDv:0000154
in_subset: granular stage

Axiom
annotated source: 60-year-old human stage
annotated property: definition
annotated target: Middle aged stage that refers to an adult who is over 60 and under 61.
database_cross_reference: Bgee:curator

61-year-old human stage
type: Class
subclass of: human life cycle stage
subclass of: Restriction
  on property: part of
  some values from: human middle aged stage
subclass of: Restriction
  on property: immediately_preceded_by
  some values from: 60-year-old human stage
definition: Middle aged stage that refers to an adult who is over 61 and under 62.
end, years post birth: 62.0
start, years post birth: 61.0
database_cross_reference: EV:0300114
has_obo_namespace: human_developmental_stage
id: HsapDv:0000155
in_subset: granular stage

Axiom
annotated source: 61-year-old human stage
annotated property: definition
annotated target: Middle aged stage that refers to an adult who is over 61 and under 62.
database_cross_reference: Bgee:curator

62-year-old human stage
type: Class
subclass of: human life cycle stage
subclass of: Restriction
  on property: part of
  some values from: human middle aged stage
subclass of: Restriction
  on property: immediately_preceded_by
  some values from: 61-year-old human stage
definition: Middle aged stage that refers to an adult who is over 62 and under 63.
end, years post birth: 63.0
start, years post birth: 62.0
database_cross_reference: EV:0300115
has_obo_namespace: human_developmental_stage
id: HsapDv:0000156
in_subset: granular stage

Axiom
annotated source: 62-year-old human stage
annotated property: definition
annotated target: Middle aged stage that refers to an adult who is over 62 and under 63.
database_cross_reference: Bgee:curator

63-year-old human stage
type: Class
subclass of: human life cycle stage
subclass of: Restriction
  on property: part of
  some values from: human middle aged stage
subclass of: Restriction
  on property: immediately_preceded_by
  some values from: 62-year-old human stage
definition: Middle aged stage that refers to an adult who is over 63 and under 64.
end, years post birth: 64.0
start, years post birth: 63.0
database_cross_reference: EV:0300116
has_obo_namespace: human_developmental_stage
id: HsapDv:0000157
in_subset: granular stage

Axiom
annotated source: 63-year-old human stage
annotated property: definition
annotated target: Middle aged stage that refers to an adult who is over 63 and under 64.
database_cross_reference: Bgee:curator

64-year-old human stage
type: Class
subclass of: human life cycle stage
subclass of: Restriction
  on property: part of
  some values from: human middle aged stage
subclass of: Restriction
  on property: immediately_preceded_by
  some values from: 63-year-old human stage
definition: Middle aged stage that refers to an adult who is over 64 and under 65.
end, years post birth: 65.0
start, years post birth: 64.0
database_cross_reference: EV:0300117
has_obo_namespace: human_developmental_stage
id: HsapDv:0000158
in_subset: granular stage

Axiom
annotated source: 64-year-old human stage
annotated property: definition
annotated target: Middle aged stage that refers to an adult who is over 64 and under 65.
database_cross_reference: Bgee:curator

65-year-old human stage
type: Class
subclass of: human life cycle stage
subclass of: Restriction
  on property: part of
  some values from: 65-79 year-old human stage
subclass of: Restriction
  on property: immediately_preceded_by
  some values from: 64-year-old human stage
definition: Adult stage that refers to an adult who is over 65 and under 66.
end, years post birth: 66.0
start, years post birth: 65.0
database_cross_reference: EV:0300118
has_obo_namespace: human_developmental_stage
id: HsapDv:0000159
in_subset: granular stage

Axiom
annotated source: 65-year-old human stage
annotated property: definition
annotated target: Adult stage that refers to an adult who is over 65 and under 66.
database_cross_reference: Bgee:curator

66-year-old human stage
type: Class
subclass of: human life cycle stage
subclass of: Restriction
  on property: part of
  some values from: 65-79 year-old human stage
subclass of: Restriction
  on property: immediately_preceded_by
  some values from: 65-year-old human stage
definition: Adult stage that refers to an adult who is over 66 and under 67.
end, years post birth: 67.0
start, years post birth: 66.0
database_cross_reference: EV:0300119
has_obo_namespace: human_developmental_stage
id: HsapDv:0000160
in_subset: granular stage

Axiom
annotated source: 66-year-old human stage
annotated property: definition
annotated target: Adult stage that refers to an adult who is over 66 and under 67.
database_cross_reference: Bgee:curator

67-year-old human stage
type: Class
subclass of: human life cycle stage
subclass of: Restriction
  on property: part of
  some values from: 65-79 year-old human stage
subclass of: Restriction
  on property: immediately_preceded_by
  some values from: 66-year-old human stage
definition: Adult stage that refers to an adult who is over 67 and under 68.
end, years post birth: 68.0
start, years post birth: 67.0
database_cross_reference: EV:0300120
has_obo_namespace: human_developmental_stage
id: HsapDv:0000161
in_subset: granular stage

Axiom
annotated source: 67-year-old human stage
annotated property: definition
annotated target: Adult stage that refers to an adult who is over 67 and under 68.
database_cross_reference: Bgee:curator

68-year-old human stage
type: Class
subclass of: human life cycle stage
subclass of: Restriction
  on property: part of
  some values from: 65-79 year-old human stage
subclass of: Restriction
  on property: immediately_preceded_by
  some values from: 67-year-old human stage
definition: Adult stage that refers to an adult who is over 68 and under 69.
end, years post birth: 69.0
start, years post birth: 68.0
database_cross_reference: EV:0300121
has_obo_namespace: human_developmental_stage
id: HsapDv:0000162
in_subset: granular stage

Axiom
annotated source: 68-year-old human stage
annotated property: definition
annotated target: Adult stage that refers to an adult who is over 68 and under 69.
database_cross_reference: Bgee:curator

69-year-old human stage
type: Class
subclass of: human life cycle stage
subclass of: Restriction
  on property: part of
  some values from: 65-79 year-old human stage
subclass of: Restriction
  on property: immediately_preceded_by
  some values from: 68-year-old human stage
definition: Adult stage that refers to an adult who is over 69 and under 70.
end, years post birth: 70.0
start, years post birth: 69.0
database_cross_reference: EV:0300122
has_obo_namespace: human_developmental_stage
id: HsapDv:0000163
in_subset: granular stage

Axiom
annotated source: 69-year-old human stage
annotated property: definition
annotated target: Adult stage that refers to an adult who is over 69 and under 70.
database_cross_reference: Bgee:curator

70-year-old human stage
type: Class
subclass of: human life cycle stage
subclass of: Restriction
  on property: part of
  some values from: 65-79 year-old human stage
subclass of: Restriction
  on property: immediately_preceded_by
  some values from: 69-year-old human stage
definition: Adult stage that refers to an adult who is over 70 and under 71.
end, years post birth: 71.0
start, years post birth: 70.0
database_cross_reference: EV:0300124
has_obo_namespace: human_developmental_stage
id: HsapDv:0000164
in_subset: granular stage

Axiom
annotated source: 70-year-old human stage
annotated property: definition
annotated target: Adult stage that refers to an adult who is over 70 and under 71.
database_cross_reference: Bgee:curator

71-year-old human stage
type: Class
subclass of: human life cycle stage
subclass of: Restriction
  on property: part of
  some values from: 65-79 year-old human stage
subclass of: Restriction
  on property: immediately_preceded_by
  some values from: 70-year-old human stage
definition: Adult stage that refers to an adult who is over 71 and under 72.
end, years post birth: 72.0
start, years post birth: 71.0
database_cross_reference: EV:0300125
has_obo_namespace: human_developmental_stage
id: HsapDv:0000165
in_subset: granular stage

Axiom
annotated source: 71-year-old human stage
annotated property: definition
annotated target: Adult stage that refers to an adult who is over 71 and under 72.
database_cross_reference: Bgee:curator

72-year-old human stage
type: Class
subclass of: human life cycle stage
subclass of: Restriction
  on property: part of
  some values from: 65-79 year-old human stage
subclass of: Restriction
  on property: immediately_preceded_by
  some values from: 71-year-old human stage
definition: Adult stage that refers to an adult who is over 72 and under 73.
end, years post birth: 73.0
start, years post birth: 72.0
database_cross_reference: EV:0300126
has_obo_namespace: human_developmental_stage
id: HsapDv:0000166
in_subset: granular stage

Axiom
annotated source: 72-year-old human stage
annotated property: definition
annotated target: Adult stage that refers to an adult who is over 72 and under 73.
database_cross_reference: Bgee:curator

73-year-old human stage
type: Class
subclass of: human life cycle stage
subclass of: Restriction
  on property: part of
  some values from: 65-79 year-old human stage
subclass of: Restriction
  on property: immediately_preceded_by
  some values from: 72-year-old human stage
definition: Adult stage that refers to an adult who is over 73 and under 74.
end, years post birth: 74.0
start, years post birth: 73.0
database_cross_reference: EV:0300127
has_obo_namespace: human_developmental_stage
id: HsapDv:0000167
in_subset: granular stage

Axiom
annotated source: 73-year-old human stage
annotated property: definition
annotated target: Adult stage that refers to an adult who is over 73 and under 74.
database_cross_reference: Bgee:curator

74-year-old human stage
type: Class
subclass of: human life cycle stage
subclass of: Restriction
  on property: part of
  some values from: 65-79 year-old human stage
subclass of: Restriction
  on property: immediately_preceded_by
  some values from: 73-year-old human stage
definition: Adult stage that refers to an adult who is over 74 and under 75.
end, years post birth: 75.0
start, years post birth: 74.0
database_cross_reference: EV:0300128
has_obo_namespace: human_developmental_stage
id: HsapDv:0000168
in_subset: granular stage

Axiom
annotated source: 74-year-old human stage
annotated property: definition
annotated target: Adult stage that refers to an adult who is over 74 and under 75.
database_cross_reference: Bgee:curator

75-year-old human stage
type: Class
subclass of: human life cycle stage
subclass of: Restriction
  on property: part of
  some values from: 65-79 year-old human stage
subclass of: Restriction
  on property: immediately_preceded_by
  some values from: 74-year-old human stage
definition: Adult stage that refers to an adult who is over 75 and under 76.
end, years post birth: 76.0
start, years post birth: 75.0
database_cross_reference: EV:0300129
has_obo_namespace: human_developmental_stage
id: HsapDv:0000169
in_subset: granular stage

Axiom
annotated source: 75-year-old human stage
annotated property: definition
annotated target: Adult stage that refers to an adult who is over 75 and under 76.
database_cross_reference: Bgee:curator

76-year-old human stage
type: Class
subclass of: human life cycle stage
subclass of: Restriction
  on property: part of
  some values from: 65-79 year-old human stage
subclass of: Restriction
  on property: immediately_preceded_by
  some values from: 75-year-old human stage
definition: Adult stage that refers to an adult who is over 76 and under 77.
end, years post birth: 77.0
start, years post birth: 76.0
database_cross_reference: EV:0300130
has_obo_namespace: human_developmental_stage
id: HsapDv:0000170
in_subset: granular stage

Axiom
annotated source: 76-year-old human stage
annotated property: definition
annotated target: Adult stage that refers to an adult who is over 76 and under 77.
database_cross_reference: Bgee:curator

77-year-old human stage
type: Class
subclass of: human life cycle stage
subclass of: Restriction
  on property: part of
  some values from: 65-79 year-old human stage
subclass of: Restriction
  on property: immediately_preceded_by
  some values from: 76-year-old human stage
definition: Adult stage that refers to an adult who is over 77 and under 78.
end, years post birth: 78.0
start, years post birth: 77.0
database_cross_reference: EV:0300131
has_obo_namespace: human_developmental_stage
id: HsapDv:0000171
in_subset: granular stage

Axiom
annotated source: 77-year-old human stage
annotated property: definition
annotated target: Adult stage that refers to an adult who is over 77 and under 78.
database_cross_reference: Bgee:curator

78-year-old human stage
type: Class
subclass of: human life cycle stage
subclass of: Restriction
  on property: part of
  some values from: 65-79 year-old human stage
subclass of: Restriction
  on property: immediately_preceded_by
  some values from: 77-year-old human stage
definition: Adult stage that refers to an adult who is over 78 and under 79.
end, years post birth: 79.0
start, years post birth: 78.0
database_cross_reference: EV:0300132
has_obo_namespace: human_developmental_stage
id: HsapDv:0000172
in_subset: granular stage

Axiom
annotated source: 78-year-old human stage
annotated property: definition
annotated target: Adult stage that refers to an adult who is over 78 and under 79.
database_cross_reference: Bgee:curator

79-year-old human stage
type: Class
subclass of: human life cycle stage
subclass of: Restriction
  on property: part of
  some values from: 65-79 year-old human stage
subclass of: Restriction
  on property: immediately_preceded_by
  some values from: 78-year-old human stage
definition: Adult stage that refers to an adult who is over 79 and under 80.
end, years post birth: 80.0
start, years post birth: 79.0
database_cross_reference: EV:0300133
has_obo_namespace: human_developmental_stage
id: HsapDv:0000173
in_subset: granular stage

Axiom
annotated source: 79-year-old human stage
annotated property: definition
annotated target: Adult stage that refers to an adult who is over 79 and under 80.
database_cross_reference: Bgee:curator

1-month-old human stage
type: Class
subclass of: human life cycle stage
subclass of: Restriction
  on property: part of
  some values from: under-1-year-old human stage
definition: Infant stage that refers to an infant who is over 1 and under 2 months old.
end, months post birth: 2.0
start, months post birth: 1.0
database_cross_reference: EV:0300039
has_obo_namespace: human_developmental_stage
id: HsapDv:0000174
in_subset: granular stage

Axiom
annotated source: 1-month-old human stage
annotated property: definition
annotated target: Infant stage that refers to an infant who is over 1 and under 2 months old.
database_cross_reference: Bgee:curator

2-month-old human stage
type: Class
subclass of: human life cycle stage
subclass of: Restriction
  on property: part of
  some values from: under-1-year-old human stage
subclass of: Restriction
  on property: immediately_preceded_by
  some values from: 1-month-old human stage
definition: Infant stage that refers to an infant who is over 2 and under 3 months old.
end, months post birth: 3.0
start, months post birth: 2.0
database_cross_reference: EV:0300040
has_obo_namespace: human_developmental_stage
id: HsapDv:0000175
in_subset: granular stage

Axiom
annotated source: 2-month-old human stage
annotated property: definition
annotated target: Infant stage that refers to an infant who is over 2 and under 3 months old.
database_cross_reference: Bgee:curator

3-month-old human stage
type: Class
subclass of: human life cycle stage
subclass of: Restriction
  on property: part of
  some values from: under-1-year-old human stage
subclass of: Restriction
  on property: immediately_preceded_by
  some values from: 2-month-old human stage
definition: Infant stage that refers to an infant who is over 3 and under 4 months old.
end, months post birth: 4.0
start, months post birth: 3.0
database_cross_reference: EV:0300041
has_obo_namespace: human_developmental_stage
id: HsapDv:0000176
in_subset: granular stage

Axiom
annotated source: 3-month-old human stage
annotated property: definition
annotated target: Infant stage that refers to an infant who is over 3 and under 4 months old.
database_cross_reference: Bgee:curator

4-month-old human stage
type: Class
subclass of: human life cycle stage
subclass of: Restriction
  on property: part of
  some values from: under-1-year-old human stage
subclass of: Restriction
  on property: immediately_preceded_by
  some values from: 3-month-old human stage
definition: Infant stage that refers to an infant who is over 4 and under 5 months old.
end, months post birth: 5.0
start, months post birth: 4.0
database_cross_reference: EV:0300042
has_obo_namespace: human_developmental_stage
id: HsapDv:0000177
in_subset: granular stage

Axiom
annotated source: 4-month-old human stage
annotated property: definition
annotated target: Infant stage that refers to an infant who is over 4 and under 5 months old.
database_cross_reference: Bgee:curator

5-month-old human stage
type: Class
subclass of: human life cycle stage
subclass of: Restriction
  on property: part of
  some values from: under-1-year-old human stage
subclass of: Restriction
  on property: immediately_preceded_by
  some values from: 4-month-old human stage
definition: Infant stage that refers to an infant who is over 5 and under 6 months old.
end, months post birth: 6.0
start, months post birth: 5.0
database_cross_reference: EV:0300043
has_obo_namespace: human_developmental_stage
id: HsapDv:0000178
in_subset: granular stage

Axiom
annotated source: 5-month-old human stage
annotated property: definition
annotated target: Infant stage that refers to an infant who is over 5 and under 6 months old.
database_cross_reference: Bgee:curator

6-month-old human stage
type: Class
subclass of: human life cycle stage
subclass of: Restriction
  on property: part of
  some values from: under-1-year-old human stage
subclass of: Restriction
  on property: immediately_preceded_by
  some values from: 5-month-old human stage
definition: Infant stage that refers to an infant who is over 6 and under 7 months old.
end, months post birth: 7.0
start, months post birth: 6.0
database_cross_reference: EV:0300044
has_obo_namespace: human_developmental_stage
id: HsapDv:0000179
in_subset: granular stage

Axiom
annotated source: 6-month-old human stage
annotated property: definition
annotated target: Infant stage that refers to an infant who is over 6 and under 7 months old.
database_cross_reference: Bgee:curator

7-month-old human stage
type: Class
subclass of: human life cycle stage
subclass of: Restriction
  on property: part of
  some values from: under-1-year-old human stage
subclass of: Restriction
  on property: immediately_preceded_by
  some values from: 6-month-old human stage
definition: Infant stage that refers to an infant who is over 7 and under 8 months old.
end, months post birth: 8.0
start, months post birth: 7.0
database_cross_reference: EV:0300045
has_obo_namespace: human_developmental_stage
id: HsapDv:0000180
in_subset: granular stage

Axiom
annotated source: 7-month-old human stage
annotated property: definition
annotated target: Infant stage that refers to an infant who is over 7 and under 8 months old.
database_cross_reference: Bgee:curator

8-month-old human stage
type: Class
subclass of: human life cycle stage
subclass of: Restriction
  on property: part of
  some values from: under-1-year-old human stage
subclass of: Restriction
  on property: immediately_preceded_by
  some values from: 7-month-old human stage
definition: Infant stage that refers to an infant who is over 8 and under 9 months old.
end, months post birth: 9.0
start, months post birth: 8.0
database_cross_reference: EV:0300046
has_obo_namespace: human_developmental_stage
id: HsapDv:0000181
in_subset: granular stage

Axiom
annotated source: 8-month-old human stage
annotated property: definition
annotated target: Infant stage that refers to an infant who is over 8 and under 9 months old.
database_cross_reference: Bgee:curator

9-month-old human stage
type: Class
subclass of: human life cycle stage
subclass of: Restriction
  on property: part of
  some values from: under-1-year-old human stage
subclass of: Restriction
  on property: immediately_preceded_by
  some values from: 8-month-old human stage
definition: Infant stage that refers to an infant who is over 9 and under 10 months old.
end, months post birth: 10.0
start, months post birth: 9.0
database_cross_reference: EV:0300047
has_obo_namespace: human_developmental_stage
id: HsapDv:0000182
in_subset: granular stage

Axiom
annotated source: 9-month-old human stage
annotated property: definition
annotated target: Infant stage that refers to an infant who is over 9 and under 10 months old.
database_cross_reference: Bgee:curator

10-month-old human stage
type: Class
subclass of: human life cycle stage
subclass of: Restriction
  on property: part of
  some values from: under-1-year-old human stage
subclass of: Restriction
  on property: immediately_preceded_by
  some values from: 9-month-old human stage
definition: Infant stage that refers to an infant who is over 10 and under 11 months old.
end, months post birth: 11.0
start, months post birth: 10.0
database_cross_reference: EV:0300048
has_obo_namespace: human_developmental_stage
id: HsapDv:0000183
in_subset: granular stage

Axiom
annotated source: 10-month-old human stage
annotated property: definition
annotated target: Infant stage that refers to an infant who is over 10 and under 11 months old.
database_cross_reference: Bgee:curator

11-month-old human stage
type: Class
subclass of: human life cycle stage
subclass of: Restriction
  on property: part of
  some values from: under-1-year-old human stage
subclass of: Restriction
  on property: immediately_preceded_by
  some values from: 10-month-old human stage
definition: Infant stage that refers to an infant who is over 11 and under 12 months old.
end, months post birth: 12.0
start, months post birth: 11.0
database_cross_reference: EV:0300049
has_obo_namespace: human_developmental_stage
id: HsapDv:0000184
in_subset: granular stage

Axiom
annotated source: 11-month-old human stage
annotated property: definition
annotated target: Infant stage that refers to an infant who is over 11 and under 12 months old.
database_cross_reference: Bgee:curator

12-month-old human stage
type: Class
subclass of: human life cycle stage
subclass of: Restriction
  on property: part of
  some values from: 1-year-old human stage
subclass of: Restriction
  on property: immediately_preceded_by
  some values from: 11-month-old human stage
definition: Infant stage that refers to an infant who is over 12 and under 13 months old.
end, months post birth: 13.0
start, months post birth: 12.0
has_obo_namespace: human_developmental_stage
id: HsapDv:0000185
in_subset: granular stage

Axiom
annotated source: 12-month-old human stage
annotated property: definition
annotated target: Infant stage that refers to an infant who is over 12 and under 13 months old.
database_cross_reference: Bgee:curator

13-month-old human stage
type: Class
subclass of: human life cycle stage
subclass of: Restriction
  on property: part of
  some values from: 1-year-old human stage
subclass of: Restriction
  on property: immediately_preceded_by
  some values from: 12-month-old human stage
definition: Infant stage that refers to an infant who is over 13 and under 14 months old.
end, months post birth: 14.0
start, months post birth: 13.0
has_obo_namespace: human_developmental_stage
id: HsapDv:0000186
in_subset: granular stage

Axiom
annotated source: 13-month-old human stage
annotated property: definition
annotated target: Infant stage that refers to an infant who is over 13 and under 14 months old.
database_cross_reference: Bgee:curator

14-month-old human stage
type: Class
subclass of: human life cycle stage
subclass of: Restriction
  on property: part of
  some values from: 1-year-old human stage
subclass of: Restriction
  on property: immediately_preceded_by
  some values from: 13-month-old human stage
definition: Infant stage that refers to an infant who is over 14 and under 15 months old.
end, months post birth: 15.0
start, months post birth: 14.0
has_obo_namespace: human_developmental_stage
id: HsapDv:0000187
in_subset: granular stage

Axiom
annotated source: 14-month-old human stage
annotated property: definition
annotated target: Infant stage that refers to an infant who is over 14 and under 15 months old.
database_cross_reference: Bgee:curator

15-month-old human stage
type: Class
subclass of: human life cycle stage
subclass of: Restriction
  on property: part of
  some values from: 1-year-old human stage
subclass of: Restriction
  on property: immediately_preceded_by
  some values from: 14-month-old human stage
definition: Infant stage that refers to an infant who is over 15 and under 16 months old.
end, months post birth: 16.0
start, months post birth: 15.0
has_obo_namespace: human_developmental_stage
id: HsapDv:0000188
in_subset: granular stage

Axiom
annotated source: 15-month-old human stage
annotated property: definition
annotated target: Infant stage that refers to an infant who is over 15 and under 16 months old.
database_cross_reference: Bgee:curator

16-month-old human stage
type: Class
subclass of: human life cycle stage
subclass of: Restriction
  on property: part of
  some values from: 1-year-old human stage
subclass of: Restriction
  on property: immediately_preceded_by
  some values from: 15-month-old human stage
definition: Infant stage that refers to an infant who is over 16 and under 17 months old.
end, months post birth: 17.0
start, months post birth: 16.0
has_obo_namespace: human_developmental_stage
id: HsapDv:0000189
in_subset: granular stage

Axiom
annotated source: 16-month-old human stage
annotated property: definition
annotated target: Infant stage that refers to an infant who is over 16 and under 17 months old.
database_cross_reference: Bgee:curator

17-month-old human stage
type: Class
subclass of: human life cycle stage
subclass of: Restriction
  on property: part of
  some values from: 1-year-old human stage
subclass of: Restriction
  on property: immediately_preceded_by
  some values from: 16-month-old human stage
definition: Infant stage that refers to an infant who is over 17 and under 18 months old.
end, months post birth: 18.0
start, months post birth: 17.0
has_obo_namespace: human_developmental_stage
id: HsapDv:0000190
in_subset: granular stage

Axiom
annotated source: 17-month-old human stage
annotated property: definition
annotated target: Infant stage that refers to an infant who is over 17 and under 18 months old.
database_cross_reference: Bgee:curator

18-month-old human stage
type: Class
subclass of: human life cycle stage
subclass of: Restriction
  on property: part of
  some values from: 1-year-old human stage
subclass of: Restriction
  on property: immediately_preceded_by
  some values from: 17-month-old human stage
definition: Infant stage that refers to an infant who is over 18 and under 19 months old.
end, months post birth: 19.0
start, months post birth: 18.0
has_obo_namespace: human_developmental_stage
id: HsapDv:0000191
in_subset: granular stage

Axiom
annotated source: 18-month-old human stage
annotated property: definition
annotated target: Infant stage that refers to an infant who is over 18 and under 19 months old.
database_cross_reference: Bgee:curator

19-month-old human stage
type: Class
subclass of: human life cycle stage
subclass of: Restriction
  on property: part of
  some values from: 1-year-old human stage
subclass of: Restriction
  on property: immediately_preceded_by
  some values from: 18-month-old human stage
definition: Infant stage that refers to an infant who is over 19 and under 20 months old.
end, months post birth: 20.0
start, months post birth: 19.0
has_obo_namespace: human_developmental_stage
id: HsapDv:0000192
in_subset: granular stage

Axiom
annotated source: 19-month-old human stage
annotated property: definition
annotated target: Infant stage that refers to an infant who is over 19 and under 20 months old.
database_cross_reference: Bgee:curator

20-month-old human stage
type: Class
subclass of: human life cycle stage
subclass of: Restriction
  on property: part of
  some values from: 1-year-old human stage
subclass of: Restriction
  on property: immediately_preceded_by
  some values from: 19-month-old human stage
definition: Infant stage that refers to an infant who is over 20 and under 21 months old.
end, months post birth: 21.0
start, months post birth: 20.0
has_obo_namespace: human_developmental_stage
id: HsapDv:0000193
in_subset: granular stage

Axiom
annotated source: 20-month-old human stage
annotated property: definition
annotated target: Infant stage that refers to an infant who is over 20 and under 21 months old.
database_cross_reference: Bgee:curator

21-month-old human stage
type: Class
subclass of: human life cycle stage
subclass of: Restriction
  on property: part of
  some values from: 1-year-old human stage
subclass of: Restriction
  on property: immediately_preceded_by
  some values from: 20-month-old human stage
definition: Infant stage that refers to an infant who is over 21 and under 22 months old.
end, months post birth: 22.0
start, months post birth: 21.0
has_obo_namespace: human_developmental_stage
id: HsapDv:0000194
in_subset: granular stage

Axiom
annotated source: 21-month-old human stage
annotated property: definition
annotated target: Infant stage that refers to an infant who is over 21 and under 22 months old.
database_cross_reference: Bgee:curator

22-month-old human stage
type: Class
subclass of: human life cycle stage
subclass of: Restriction
  on property: part of
  some values from: 1-year-old human stage
subclass of: Restriction
  on property: immediately_preceded_by
  some values from: 21-month-old human stage
definition: Infant stage that refers to an infant who is over 22 and under 23 months old.
end, months post birth: 23.0
start, months post birth: 22.0
has_obo_namespace: human_developmental_stage
id: HsapDv:0000195
in_subset: granular stage

Axiom
annotated source: 22-month-old human stage
annotated property: definition
annotated target: Infant stage that refers to an infant who is over 22 and under 23 months old.
database_cross_reference: Bgee:curator

23-month-old human stage
type: Class
subclass of: human life cycle stage
subclass of: Restriction
  on property: part of
  some values from: 1-year-old human stage
subclass of: Restriction
  on property: immediately_preceded_by
  some values from: 22-month-old human stage
definition: Infant stage that refers to an infant who is over 23 and under 24 months old.
end, months post birth: 24.0
end, years post birth: 2.0
start, months post birth: 23.0
has_obo_namespace: human_developmental_stage
id: HsapDv:0000196
in_subset: granular stage

Axiom
annotated source: 23-month-old human stage
annotated property: definition
annotated target: Infant stage that refers to an infant who is over 23 and under 24 months old.
database_cross_reference: Bgee:curator

third LMP month human stage
type: Class
subclass of: human life cycle stage
subclass of: Restriction
  on property: part of
  some values from: fetal stage
definition: Fetal stage that refers to the third month of gestation starting from the last menstrual period (LMP).
month of gestation: 3.0
end, days post fertilization: 77.0
start, days post fertilization: 56.0
has_obo_namespace: human_developmental_stage
id: HsapDv:0000197

Axiom
annotated source: third LMP month human stage
annotated property: definition
annotated target: Fetal stage that refers to the third month of gestation starting from the last menstrual period (LMP).
database_cross_reference: Bgee:curator

fourth LMP month human stage
type: Class
subclass of: human life cycle stage
subclass of: Restriction
  on property: part of
  some values from: fetal stage
subclass of: Restriction
  on property: immediately_preceded_by
  some values from: third LMP month human stage
definition: Fetal stage that refers to the fourth month of gestation starting from the last menstrual period (LMP).
month of gestation: 4.0
end, days post fertilization: 105.0
start, days post fertilization: 77.0
has_obo_namespace: human_developmental_stage
id: HsapDv:0000198

Axiom
annotated source: fourth LMP month human stage
annotated property: definition
annotated target: Fetal stage that refers to the fourth month of gestation starting from the last menstrual period (LMP).
database_cross_reference: Bgee:curator

fifth LMP month human stage
type: Class
subclass of: human life cycle stage
subclass of: Restriction
  on property: part of
  some values from: fetal stage
subclass of: Restriction
  on property: immediately_preceded_by
  some values from: fourth LMP month human stage
definition: Fetal stage that refers to the fifth month of gestation starting from the last menstrual period (LMP).
month of gestation: 5.0
end, days post fertilization: 133.0
start, days post fertilization: 105.0
has_obo_namespace: human_developmental_stage
id: HsapDv:0000199

Axiom
annotated source: fifth LMP month human stage
annotated property: definition
annotated target: Fetal stage that refers to the fifth month of gestation starting from the last menstrual period (LMP).
database_cross_reference: Bgee:curator

sixth LMP month human stage
type: Class
subclass of: human life cycle stage
subclass of: Restriction
  on property: part of
  some values from: fetal stage
subclass of: Restriction
  on property: immediately_preceded_by
  some values from: fifth LMP month human stage
definition: Fetal stage that refers to the sixth month of gestation starting from the last menstrual period (LMP).
month of gestation: 6.0
end, days post fertilization: 168.0
start, days post fertilization: 133.0
has_obo_namespace: human_developmental_stage
id: HsapDv:0000200

Axiom
annotated source: sixth LMP month human stage
annotated property: definition
annotated target: Fetal stage that refers to the sixth month of gestation starting from the last menstrual period (LMP).
database_cross_reference: Bgee:curator

seventh LMP month human stage
type: Class
subclass of: human life cycle stage
subclass of: Restriction
  on property: part of
  some values from: fetal stage
subclass of: Restriction
  on property: immediately_preceded_by
  some values from: sixth LMP month human stage
definition: Fetal stage that refers to the seventh month of gestation starting from the last menstrual period (LMP).
month of gestation: 7.0
end, days post fertilization: 196.0
start, days post fertilization: 168.0
has_obo_namespace: human_developmental_stage
id: HsapDv:0000201

Axiom
annotated source: seventh LMP month human stage
annotated property: definition
annotated target: Fetal stage that refers to the seventh month of gestation starting from the last menstrual period (LMP).
database_cross_reference: Bgee:curator

eighth LMP month human stage
type: Class
subclass of: human life cycle stage
subclass of: Restriction
  on property: part of
  some values from: fetal stage
subclass of: Restriction
  on property: immediately_preceded_by
  some values from: seventh LMP month human stage
definition: Fetal stage that refers to the eighth month of gestation starting from the last menstrual period (LMP).
month of gestation: 8.0
end, days post fertilization: 231.0
start, days post fertilization: 196.0
has_obo_namespace: human_developmental_stage
id: HsapDv:0000202

Axiom
annotated source: eighth LMP month human stage
annotated property: definition
annotated target: Fetal stage that refers to the eighth month of gestation starting from the last menstrual period (LMP).
database_cross_reference: Bgee:curator

ninth LMP month human stage
type: Class
subclass of: human life cycle stage
subclass of: Restriction
  on property: part of
  some values from: fetal stage
subclass of: Restriction
  on property: immediately_preceded_by
  some values from: eighth LMP month human stage
definition: Fetal stage that refers to the ninth month of gestation starting from the last menstrual period (LMP).
month of gestation: 9.0
end, days post fertilization: 266.0
start, days post fertilization: 231.0
has_obo_namespace: human_developmental_stage
id: HsapDv:0000203

Axiom
annotated source: ninth LMP month human stage
annotated property: definition
annotated target: Fetal stage that refers to the ninth month of gestation starting from the last menstrual period (LMP).
database_cross_reference: Bgee:curator

mature stage
type: Class
subclass of: human life cycle stage
subclass of: Restriction
  on property: part of
  some values from: human life cycle
definition: Human developmental stage that refers to a sexually mature human.
start, years post birth: 13.0
database_cross_reference: UBERON:0000113
has_obo_namespace: human_developmental_stage
id: HsapDv:0000204

Axiom
annotated source: mature stage
annotated property: definition
annotated target: Human developmental stage that refers to a sexually mature human.
database_cross_reference: Bgee:curator

morula stage
type: Class
subclass of: human life cycle stage
subclass of: Restriction
  on property: part of
  some values from: Carnegie stage 02
subclass of: Restriction
  on property: immediately_preceded_by
  some values from: cleavage stage
definition: The morula stage is the later part of Carnegie stage 02 when the cells have coalesced into a mass but the blastocystic cavity has not formed. Formation of the cavity marks the beginning of Carnegie stage 03.
has_obo_namespace: human_developmental_stage
id: HsapDv:0000205

Axiom
annotated source: morula stage
annotated property: definition
annotated target: The morula stage is the later part of Carnegie stage 02 when the cells have coalesced into a mass but the blastocystic cavity has not formed. Formation of the cavity marks the beginning of Carnegie stage 03.
database_cross_reference: Bgee:curator

80-year-old human stage
type: Class
subclass of: human life cycle stage
subclass of: Restriction
  on property: part of
  some values from: 80 year-old and over human stage
definition: Aged stage that refers to an adult who is over 80 and under 81.
end, years post birth: 81.0
start, years post birth: 80.0
has_obo_namespace: human_developmental_stage
id: HsapDv:0000206
in_subset: granular stage

Axiom
annotated source: 80-year-old human stage
annotated property: definition
annotated target: Aged stage that refers to an adult who is over 80 and under 81.
database_cross_reference: Bgee:curator

81-year-old human stage
type: Class
subclass of: human life cycle stage
subclass of: Restriction
  on property: part of
  some values from: 80 year-old and over human stage
subclass of: Restriction
  on property: immediately_preceded_by
  some values from: 80-year-old human stage
definition: Aged stage that refers to an adult who is over 81 and under 82.
end, years post birth: 82.0
start, years post birth: 81.0
has_obo_namespace: human_developmental_stage
id: HsapDv:0000207
in_subset: granular stage

Axiom
annotated source: 81-year-old human stage
annotated property: definition
annotated target: Aged stage that refers to an adult who is over 81 and under 82.
database_cross_reference: Bgee:curator

82-year-old human stage
type: Class
subclass of: human life cycle stage
subclass of: Restriction
  on property: part of
  some values from: 80 year-old and over human stage
subclass of: Restriction
  on property: immediately_preceded_by
  some values from: 81-year-old human stage
definition: Aged stage that refers to an adult who is over 82 and under 83.
end, years post birth: 83.0
start, years post birth: 82.0
has_obo_namespace: human_developmental_stage
id: HsapDv:0000208
in_subset: granular stage

Axiom
annotated source: 82-year-old human stage
annotated property: definition
annotated target: Aged stage that refers to an adult who is over 82 and under 83.
database_cross_reference: Bgee:curator

83-year-old human stage
type: Class
subclass of: human life cycle stage
subclass of: Restriction
  on property: part of
  some values from: 80 year-old and over human stage
subclass of: Restriction
  on property: immediately_preceded_by
  some values from: 82-year-old human stage
definition: Aged stage that refers to an adult who is over 83 and under 84.
end, years post birth: 84.0
start, years post birth: 83.0
has_obo_namespace: human_developmental_stage
id: HsapDv:0000209
in_subset: granular stage

Axiom
annotated source: 83-year-old human stage
annotated property: definition
annotated target: Aged stage that refers to an adult who is over 83 and under 84.
database_cross_reference: Bgee:curator

84-year-old human stage
type: Class
subclass of: human life cycle stage
subclass of: Restriction
  on property: part of
  some values from: 80 year-old and over human stage
subclass of: Restriction
  on property: immediately_preceded_by
  some values from: 83-year-old human stage
definition: Aged stage that refers to an adult who is over 84 and under 85.
end, years post birth: 85.0
start, years post birth: 84.0
has_obo_namespace: human_developmental_stage
id: HsapDv:0000210
in_subset: granular stage

Axiom
annotated source: 84-year-old human stage
annotated property: definition
annotated target: Aged stage that refers to an adult who is over 84 and under 85.
database_cross_reference: Bgee:curator

85-year-old human stage
type: Class
subclass of: human life cycle stage
subclass of: Restriction
  on property: part of
  some values from: 80 year-old and over human stage
subclass of: Restriction
  on property: immediately_preceded_by
  some values from: 84-year-old human stage
definition: Aged stage that refers to an adult who is over 85 and under 86.
end, years post birth: 86.0
start, years post birth: 85.0
has_obo_namespace: human_developmental_stage
id: HsapDv:0000211
in_subset: granular stage

Axiom
annotated source: 85-year-old human stage
annotated property: definition
annotated target: Aged stage that refers to an adult who is over 85 and under 86.
database_cross_reference: Bgee:curator

86-year-old human stage
type: Class
subclass of: human life cycle stage
subclass of: Restriction
  on property: part of
  some values from: 80 year-old and over human stage
subclass of: Restriction
  on property: immediately_preceded_by
  some values from: 85-year-old human stage
definition: Aged stage that refers to an adult who is over 86 and under 87.
end, years post birth: 87.0
start, years post birth: 86.0
has_obo_namespace: human_developmental_stage
id: HsapDv:0000212
in_subset: granular stage

Axiom
annotated source: 86-year-old human stage
annotated property: definition
annotated target: Aged stage that refers to an adult who is over 86 and under 87.
database_cross_reference: Bgee:curator

87-year-old human stage
type: Class
subclass of: human life cycle stage
subclass of: Restriction
  on property: part of
  some values from: 80 year-old and over human stage
subclass of: Restriction
  on property: immediately_preceded_by
  some values from: 86-year-old human stage
definition: Aged stage that refers to an adult who is over 87 and under 88.
end, years post birth: 88.0
start, years post birth: 87.0
has_obo_namespace: human_developmental_stage
id: HsapDv:0000213
in_subset: granular stage

Axiom
annotated source: 87-year-old human stage
annotated property: definition
annotated target: Aged stage that refers to an adult who is over 87 and under 88.
database_cross_reference: Bgee:curator

88-year-old human stage
type: Class
subclass of: human life cycle stage
subclass of: Restriction
  on property: part of
  some values from: 80 year-old and over human stage
subclass of: Restriction
  on property: immediately_preceded_by
  some values from: 87-year-old human stage
definition: Aged stage that refers to an adult who is over 88 and under 89.
end, years post birth: 89.0
start, years post birth: 88.0
has_obo_namespace: human_developmental_stage
id: HsapDv:0000214
in_subset: granular stage

Axiom
annotated source: 88-year-old human stage
annotated property: definition
annotated target: Aged stage that refers to an adult who is over 88 and under 89.
database_cross_reference: Bgee:curator

89-year-old human stage
type: Class
subclass of: human life cycle stage
subclass of: Restriction
  on property: part of
  some values from: 80 year-old and over human stage
subclass of: Restriction
  on property: immediately_preceded_by
  some values from: 88-year-old human stage
definition: Aged stage that refers to an adult who is over 89 and under 90.
end, years post birth: 90.0
start, years post birth: 89.0
has_obo_namespace: human_developmental_stage
id: HsapDv:0000215
in_subset: granular stage

Axiom
annotated source: 89-year-old human stage
annotated property: definition
annotated target: Aged stage that refers to an adult who is over 89 and under 90.
database_cross_reference: Bgee:curator

90-year-old human stage
type: Class
subclass of: human life cycle stage
subclass of: Restriction
  on property: part of
  some values from: 80 year-old and over human stage
subclass of: Restriction
  on property: immediately_preceded_by
  some values from: 89-year-old human stage
definition: Aged stage that refers to an adult who is over 90 and under 91.
end, years post birth: 91.0
start, years post birth: 90.0
has_obo_namespace: human_developmental_stage
id: HsapDv:0000216
in_subset: granular stage

Axiom
annotated source: 90-year-old human stage
annotated property: definition
annotated target: Aged stage that refers to an adult who is over 90 and under 91.
database_cross_reference: Bgee:curator

91-year-old human stage
type: Class
subclass of: human life cycle stage
subclass of: Restriction
  on property: part of
  some values from: 80 year-old and over human stage
subclass of: Restriction
  on property: immediately_preceded_by
  some values from: 90-year-old human stage
definition: Aged stage that refers to an adult who is over 91 and under 92.
end, years post birth: 92.0
start, years post birth: 91.0
has_obo_namespace: human_developmental_stage
id: HsapDv:0000217
in_subset: granular stage

Axiom
annotated source: 91-year-old human stage
annotated property: definition
annotated target: Aged stage that refers to an adult who is over 91 and under 92.
database_cross_reference: Bgee:curator

92-year-old human stage
type: Class
subclass of: human life cycle stage
subclass of: Restriction
  on property: part of
  some values from: 80 year-old and over human stage
subclass of: Restriction
  on property: immediately_preceded_by
  some values from: 91-year-old human stage
definition: Aged stage that refers to an adult who is over 92 and under 93.
end, years post birth: 93.0
start, years post birth: 92.0
has_obo_namespace: human_developmental_stage
id: HsapDv:0000218
in_subset: granular stage

Axiom
annotated source: 92-year-old human stage
annotated property: definition
annotated target: Aged stage that refers to an adult who is over 92 and under 93.
database_cross_reference: Bgee:curator

93-year-old human stage
type: Class
subclass of: human life cycle stage
subclass of: Restriction
  on property: part of
  some values from: 80 year-old and over human stage
subclass of: Restriction
  on property: immediately_preceded_by
  some values from: 92-year-old human stage
definition: Aged stage that refers to an adult who is over 93 and under 94.
end, years post birth: 94.0
start, years post birth: 93.0
has_obo_namespace: human_developmental_stage
id: HsapDv:0000219
in_subset: granular stage

Axiom
annotated source: 93-year-old human stage
annotated property: definition
annotated target: Aged stage that refers to an adult who is over 93 and under 94.
database_cross_reference: Bgee:curator

94-year-old human stage
type: Class
subclass of: human life cycle stage
subclass of: Restriction
  on property: part of
  some values from: 80 year-old and over human stage
subclass of: Restriction
  on property: immediately_preceded_by
  some values from: 93-year-old human stage
definition: Aged stage that refers to an adult who is over 94 and under 95.
end, years post birth: 95.0
start, years post birth: 94.0
has_obo_namespace: human_developmental_stage
id: HsapDv:0000220
in_subset: granular stage

Axiom
annotated source: 94-year-old human stage
annotated property: definition
annotated target: Aged stage that refers to an adult who is over 94 and under 95.
database_cross_reference: Bgee:curator

95-year-old human stage
type: Class
subclass of: human life cycle stage
subclass of: Restriction
  on property: part of
  some values from: 80 year-old and over human stage
subclass of: Restriction
  on property: immediately_preceded_by
  some values from: 94-year-old human stage
definition: Aged stage that refers to an adult who is over 95 and under 96.
end, years post birth: 96.0
start, years post birth: 95.0
has_obo_namespace: human_developmental_stage
id: HsapDv:0000221
in_subset: granular stage

Axiom
annotated source: 95-year-old human stage
annotated property: definition
annotated target: Aged stage that refers to an adult who is over 95 and under 96.
database_cross_reference: Bgee:curator

96-year-old human stage
type: Class
subclass of: human life cycle stage
subclass of: Restriction
  on property: part of
  some values from: 80 year-old and over human stage
subclass of: Restriction
  on property: immediately_preceded_by
  some values from: 95-year-old human stage
definition: Aged stage that refers to an adult who is over 96 and under 97.
end, years post birth: 97.0
start, years post birth: 96.0
has_obo_namespace: human_developmental_stage
id: HsapDv:0000222
in_subset: granular stage

Axiom
annotated source: 96-year-old human stage
annotated property: definition
annotated target: Aged stage that refers to an adult who is over 96 and under 97.
database_cross_reference: Bgee:curator

97-year-old human stage
type: Class
subclass of: human life cycle stage
subclass of: Restriction
  on property: part of
  some values from: 80 year-old and over human stage
subclass of: Restriction
  on property: immediately_preceded_by
  some values from: 96-year-old human stage
definition: Aged stage that refers to an adult who is over 97 and under 98.
end, years post birth: 98.0
start, years post birth: 97.0
has_obo_namespace: human_developmental_stage
id: HsapDv:0000223
in_subset: granular stage

Axiom
annotated source: 97-year-old human stage
annotated property: definition
annotated target: Aged stage that refers to an adult who is over 97 and under 98.
database_cross_reference: Bgee:curator

98-year-old human stage
type: Class
subclass of: human life cycle stage
subclass of: Restriction
  on property: part of
  some values from: 80 year-old and over human stage
subclass of: Restriction
  on property: immediately_preceded_by
  some values from: 97-year-old human stage
definition: Aged stage that refers to an adult who is over 98 and under 99.
end, years post birth: 99.0
start, years post birth: 98.0
has_obo_namespace: human_developmental_stage
id: HsapDv:0000224
in_subset: granular stage

Axiom
annotated source: 98-year-old human stage
annotated property: definition
annotated target: Aged stage that refers to an adult who is over 98 and under 99.
database_cross_reference: Bgee:curator

99-year-old human stage
type: Class
subclass of: human life cycle stage
subclass of: Restriction
  on property: part of
  some values from: 80 year-old and over human stage
subclass of: Restriction
  on property: immediately_preceded_by
  some values from: 98-year-old human stage
definition: Aged stage that refers to an adult who is over 99 and under 100.
end, years post birth: 100.0
start, years post birth: 99.0
has_obo_namespace: human_developmental_stage
id: HsapDv:0000225
in_subset: granular stage

Axiom
annotated source: 99-year-old human stage
annotated property: definition
annotated target: Aged stage that refers to an adult who is over 99 and under 100.
database_cross_reference: Bgee:curator

100-year-old human stage
type: Class
subclass of: human life cycle stage
subclass of: Restriction
  on property: part of
  some values from: centenarian human stage
subclass of: Restriction
  on property: immediately_preceded_by
  some values from: 99-year-old human stage
definition: Aged stage that refers to an adult who is over 100 and under 101.
end, years post birth: 101.0
start, years post birth: 100.0
has_obo_namespace: human_developmental_stage
id: HsapDv:0000228
in_subset: granular stage

Axiom
annotated source: 100-year-old human stage
annotated property: definition
annotated target: Aged stage that refers to an adult who is over 100 and under 101.
database_cross_reference: Bgee:curator

101-year-old human stage
type: Class
subclass of: human life cycle stage
subclass of: Restriction
  on property: part of
  some values from: centenarian human stage
subclass of: Restriction
  on property: immediately_preceded_by
  some values from: 100-year-old human stage
definition: Aged stage that refers to an adult who is over 101 and under 102.
end, years post birth: 102.0
start, years post birth: 101.0
has_obo_namespace: human_developmental_stage
id: HsapDv:0000229
in_subset: granular stage

Axiom
annotated source: 101-year-old human stage
annotated property: definition
annotated target: Aged stage that refers to an adult who is over 101 and under 102.
database_cross_reference: Bgee:curator

102-year-old human stage
type: Class
subclass of: human life cycle stage
subclass of: Restriction
  on property: part of
  some values from: centenarian human stage
subclass of: Restriction
  on property: immediately_preceded_by
  some values from: 101-year-old human stage
definition: Aged stage that refers to an adult who is over 102 and under 103.
end, years post birth: 103.0
start, years post birth: 102.0
has_obo_namespace: human_developmental_stage
id: HsapDv:0000230
in_subset: granular stage

Axiom
annotated source: 102-year-old human stage
annotated property: definition
annotated target: Aged stage that refers to an adult who is over 102 and under 103.
database_cross_reference: Bgee:curator

103-year-old human stage
type: Class
subclass of: human life cycle stage
subclass of: Restriction
  on property: part of
  some values from: centenarian human stage
subclass of: Restriction
  on property: immediately_preceded_by
  some values from: 102-year-old human stage
definition: Aged stage that refers to an adult who is over 103 and under 104.
end, years post birth: 104.0
start, years post birth: 103.0
has_obo_namespace: human_developmental_stage
id: HsapDv:0000231
in_subset: granular stage

Axiom
annotated source: 103-year-old human stage
annotated property: definition
annotated target: Aged stage that refers to an adult who is over 103 and under 104.
database_cross_reference: Bgee:curator

104-year-old human stage
type: Class
subclass of: human life cycle stage
subclass of: Restriction
  on property: part of
  some values from: centenarian human stage
subclass of: Restriction
  on property: immediately_preceded_by
  some values from: 103-year-old human stage
definition: Aged stage that refers to an adult who is over 104 and under 105.
end, years post birth: 105.0
start, years post birth: 104.0
has_obo_namespace: human_developmental_stage
id: HsapDv:0000232
in_subset: granular stage

Axiom
annotated source: 104-year-old human stage
annotated property: definition
annotated target: Aged stage that refers to an adult who is over 104 and under 105.
database_cross_reference: Bgee:curator

105-year-old human stage
type: Class
subclass of: human life cycle stage
subclass of: Restriction
  on property: part of
  some values from: centenarian human stage
subclass of: Restriction
  on property: immediately_preceded_by
  some values from: 104-year-old human stage
definition: Aged stage that refers to an adult who is over 105 and under 106.
end, years post birth: 106.0
start, years post birth: 105.0
has_obo_namespace: human_developmental_stage
id: HsapDv:0000233
in_subset: granular stage

Axiom
annotated source: 105-year-old human stage
annotated property: definition
annotated target: Aged stage that refers to an adult who is over 105 and under 106.
database_cross_reference: Bgee:curator

106-year-old human stage
type: Class
subclass of: human life cycle stage
subclass of: Restriction
  on property: part of
  some values from: centenarian human stage
subclass of: Restriction
  on property: immediately_preceded_by
  some values from: 105-year-old human stage
definition: Aged stage that refers to an adult who is over 106 and under 107.
end, years post birth: 107.0
start, years post birth: 106.0
has_obo_namespace: human_developmental_stage
id: HsapDv:0000234
in_subset: granular stage

Axiom
annotated source: 106-year-old human stage
annotated property: definition
annotated target: Aged stage that refers to an adult who is over 106 and under 107.
database_cross_reference: Bgee:curator

first decade human stage
type: Class
subclass of: human life cycle stage
subclass of: UBERON_0000105
subclass of: Restriction
  on property: part of
  some values from: child stage
subclass of: Restriction
  on property: only in taxon
  some values from: NCBITaxon 9606
definition: Human stage that refers to an individual who is over 0 and under 10 years old.
end, years post birth: 10.0
start, years post birth: 0.0
has_obo_namespace: human_developmental_stage
id: HsapDv:0000235

Axiom
annotated source: first decade human stage
annotated property: definition
annotated target: Human stage that refers to an individual who is over 0 and under 10 years old.
database_cross_reference: Bgee:curator

second decade human stage
type: Class
subclass of: human life cycle stage
subclass of: UBERON_0000105
subclass of: Restriction
  on property: immediately_preceded_by
  some values from: first decade human stage
subclass of: Restriction
  on property: only in taxon
  some values from: NCBITaxon 9606
definition: Human stage that refers to an individual who is over 10 and under 20 years old.
end, years post birth: 20.0
start, years post birth: 10.0
has_obo_namespace: human_developmental_stage
id: HsapDv:0000236

Axiom
annotated source: second decade human stage
annotated property: definition
annotated target: Human stage that refers to an individual who is over 10 and under 20 years old.
database_cross_reference: Bgee:curator

third decade human stage
type: Class
subclass of: human life cycle stage
subclass of: UBERON_0000105
subclass of: Restriction
  on property: part of
  some values from: human early adulthood stage
subclass of: Restriction
  on property: immediately_preceded_by
  some values from: second decade human stage
subclass of: Restriction
  on property: only in taxon
  some values from: NCBITaxon 9606
definition: Human stage that refers to an individual who is over 20 and under 30.
end, years post birth: 30.0
start, years post birth: 20.0
has_obo_namespace: human_developmental_stage
id: HsapDv:0000237

Axiom
annotated source: third decade human stage
annotated property: definition
annotated target: Human stage that refers to an individual who is over 20 and under 30.
database_cross_reference: Bgee:curator

fourth decade human stage
type: Class
subclass of: human life cycle stage
subclass of: UBERON_0000105
subclass of: Restriction
  on property: part of
  some values from: human early adulthood stage
subclass of: Restriction
  on property: immediately_preceded_by
  some values from: third decade human stage
subclass of: Restriction
  on property: only in taxon
  some values from: NCBITaxon 9606
definition: Human stage that refers to an individual who is over 30 and under 40 years old.
end, years post birth: 40.0
start, years post birth: 30.0
has_obo_namespace: human_developmental_stage
id: HsapDv:0000238

Axiom
annotated source: fourth decade human stage
annotated property: definition
annotated target: Human stage that refers to an individual who is over 30 and under 40 years old.
database_cross_reference: Bgee:curator

fifth decade human stage
type: Class
subclass of: human life cycle stage
subclass of: UBERON_0000105
subclass of: Restriction
  on property: immediately_preceded_by
  some values from: fourth decade human stage
subclass of: Restriction
  on property: only in taxon
  some values from: NCBITaxon 9606
definition: Human stage that refers to an individual who is over 40 and under 50 years old.
end, years post birth: 50.0
start, years post birth: 40.0
has_obo_namespace: human_developmental_stage
id: HsapDv:0000239

Axiom
annotated source: fifth decade human stage
annotated property: definition
annotated target: Human stage that refers to an individual who is over 40 and under 50 years old.
database_cross_reference: Bgee:curator

sixth decade human stage
type: Class
subclass of: human life cycle stage
subclass of: UBERON_0000105
subclass of: Restriction
  on property: part of
  some values from: human middle aged stage
subclass of: Restriction
  on property: immediately_preceded_by
  some values from: fifth decade human stage
subclass of: Restriction
  on property: only in taxon
  some values from: NCBITaxon 9606
definition: Human stage that refers to an individual who is over 50 and under 60 years old.
end, years post birth: 60.0
start, years post birth: 50.0
has_obo_namespace: human_developmental_stage
id: HsapDv:0000240

Axiom
annotated source: sixth decade human stage
annotated property: definition
annotated target: Human stage that refers to an individual who is over 50 and under 60 years old.
database_cross_reference: Bgee:curator

seventh decade human stage
type: Class
subclass of: human life cycle stage
subclass of: UBERON_0000105
subclass of: Restriction
  on property: immediately_preceded_by
  some values from: sixth decade human stage
subclass of: Restriction
  on property: only in taxon
  some values from: NCBITaxon 9606
definition: Human stage that refers to an individual who is over 60 and under 70 years old.
end, years post birth: 70.0
start, years post birth: 60.0
has_obo_namespace: human_developmental_stage
id: HsapDv:0000241

Axiom
annotated source: seventh decade human stage
annotated property: definition
annotated target: Human stage that refers to an individual who is over 60 and under 70 years old.
database_cross_reference: Bgee:curator

eighth decade human stage
type: Class
subclass of: human life cycle stage
subclass of: UBERON_0000105
subclass of: Restriction
  on property: part of
  some values from: human aged stage
subclass of: Restriction
  on property: immediately_preceded_by
  some values from: seventh decade human stage
subclass of: Restriction
  on property: only in taxon
  some values from: NCBITaxon 9606
definition: Human stage that refers to an individual who is over 70 and under 80 years old.
end, years post birth: 80.0
start, years post birth: 70.0
has_obo_namespace: human_developmental_stage
id: HsapDv:0000242

Axiom
annotated source: eighth decade human stage
annotated property: definition
annotated target: Human stage that refers to an individual who is over 70 and under 80 years old.
database_cross_reference: Bgee:curator

ninth decade human stage
type: Class
subclass of: human life cycle stage
subclass of: UBERON_0000105
subclass of: Restriction
  on property: part of
  some values from: human aged stage
subclass of: Restriction
  on property: immediately_preceded_by
  some values from: eighth decade human stage
subclass of: Restriction
  on property: only in taxon
  some values from: NCBITaxon 9606
definition: Human stage that refers to an individual who is over 80 and under 90 years old.
end, years post birth: 90.0
start, years post birth: 80.0
has_obo_namespace: human_developmental_stage
id: HsapDv:0000243

Axiom
annotated source: ninth decade human stage
annotated property: definition
annotated target: Human stage that refers to an individual who is over 80 and under 90 years old.
database_cross_reference: Bgee:curator

tenth decade human stage
type: Class
subclass of: human life cycle stage
subclass of: UBERON_0000105
subclass of: Restriction
  on property: part of
  some values from: human aged stage
subclass of: Restriction
  on property: immediately_preceded_by
  some values from: ninth decade human stage
subclass of: Restriction
  on property: only in taxon
  some values from: NCBITaxon 9606
definition: Human stage that refers to an individual who is over 90 and under 100 years old.
end, years post birth: 100.0
start, years post birth: 90.0
has_obo_namespace: human_developmental_stage
id: HsapDv:0000244

Axiom
annotated source: tenth decade human stage
annotated property: definition
annotated target: Human stage that refers to an individual who is over 90 and under 100 years old.
database_cross_reference: Bgee:curator

eleventh decade human stage
type: Class
subclass of: human life cycle stage
subclass of: UBERON_0000105
subclass of: Restriction
  on property: part of
  some values from: human aged stage
subclass of: Restriction
  on property: immediately_preceded_by
  some values from: tenth decade human stage
subclass of: Restriction
  on property: only in taxon
  some values from: NCBITaxon 9606
definition: Human stage that refers to a human who is over 100 and under 110 years old.
end, years post birth: 110.0
start, years post birth: 100.0
has_obo_namespace: human_developmental_stage
id: HsapDv:0000245

Axiom
annotated source: eleventh decade human stage
annotated property: definition
annotated target: Human stage that refers to a human who is over 100 and under 110 years old.
database_cross_reference: Bgee:curator

1-year-old human stage
type: Class
subclass of: human life cycle stage
subclass of: Restriction
  on property: part of
  some values from: infant stage
subclass of: Restriction
  on property: immediately_preceded_by
  some values from: 11-month-old human stage
definition: Infant stage that refers to a child who is over 1 and under 2 years old.
end, months post birth: 24.0
end, years post birth: 2.0
start, months post birth: 12.0
start, years post birth: 1.0
has_exact_synonym: 12-23 months
has_obo_namespace: human_developmental_stage
id: HsapDv:0000246

Axiom
annotated source: 1-year-old human stage
annotated property: definition
annotated target: Infant stage that refers to a child who is over 1 and under 2 years old.
database_cross_reference: Bgee:curator

centenarian human stage
type: Class
subclass of: human life cycle stage
subclass of: Restriction
  on property: part of
  some values from: 80 year-old and over human stage
subclass of: Restriction
  on property: immediately_preceded_by
  some values from: 99-year-old human stage
definition: Aged stage that refers to an adult who is over 100.
end, years post birth: 101.0
start, years post birth: 100.0
has_obo_namespace: human_developmental_stage
id: HsapDv:0000247
in_subset: granular stage

Axiom
annotated source: centenarian human stage
annotated property: definition
annotated target: Aged stage that refers to an adult who is over 100.
database_cross_reference: Bgee:curator

107-year-old human stage
type: Class
subclass of: human life cycle stage
subclass of: Restriction
  on property: part of
  some values from: centenarian human stage
subclass of: Restriction
  on property: immediately_preceded_by
  some values from: 106-year-old human stage
definition: Aged stage that refers to an adult who is over 107 and under 108.
end, years post birth: 108.0
start, years post birth: 107.0
has_obo_namespace: human_developmental_stage
id: HsapDv:0000248
in_subset: granular stage

Axiom
annotated source: 107-year-old human stage
annotated property: definition
annotated target: Aged stage that refers to an adult who is over 107 and under 108.
database_cross_reference: Bgee:curator

108-year-old human stage
type: Class
subclass of: human life cycle stage
subclass of: Restriction
  on property: part of
  some values from: centenarian human stage
subclass of: Restriction
  on property: immediately_preceded_by
  some values from: 107-year-old human stage
definition: Aged stage that refers to an adult who is over 108 and under 109.
end, years post birth: 109.0
start, years post birth: 108.0
has_obo_namespace: human_developmental_stage
id: HsapDv:0000249
in_subset: granular stage

Axiom
annotated source: 108-year-old human stage
annotated property: definition
annotated target: Aged stage that refers to an adult who is over 108 and under 109.
database_cross_reference: Bgee:curator

109-year-old human stage
type: Class
subclass of: human life cycle stage
subclass of: Restriction
  on property: part of
  some values from: centenarian human stage
subclass of: Restriction
  on property: immediately_preceded_by
  some values from: 108-year-old human stage
definition: Aged stage that refers to an adult who is over 109 and under 110.
end, years post birth: 110.0
start, years post birth: 109.0
has_obo_namespace: human_developmental_stage
id: HsapDv:0000250
in_subset: granular stage

Axiom
annotated source: 109-year-old human stage
annotated property: definition
annotated target: Aged stage that refers to an adult who is over 109 and under 110.
database_cross_reference: Bgee:curator

110-year-old human stage
type: Class
subclass of: human life cycle stage
subclass of: Restriction
  on property: part of
  some values from: centenarian human stage
subclass of: Restriction
  on property: immediately_preceded_by
  some values from: 109-year-old human stage
definition: Aged stage that refers to an adult who is over 110 and under 111.
end, years post birth: 111.0
start, years post birth: 110.0
has_obo_namespace: human_developmental_stage
id: HsapDv:0000251
in_subset: granular stage

Axiom
annotated source: 110-year-old human stage
annotated property: definition
annotated target: Aged stage that refers to an adult who is over 110 and under 111.
database_cross_reference: Bgee:curator

111-year-old human stage
type: Class
subclass of: human life cycle stage
subclass of: Restriction
  on property: part of
  some values from: centenarian human stage
subclass of: Restriction
  on property: immediately_preceded_by
  some values from: 110-year-old human stage
definition: Aged stage that refers to an adult who is over 111 and under 112.
end, years post birth: 112.0
start, years post birth: 111.0
has_obo_namespace: human_developmental_stage
id: HsapDv:0000252
in_subset: granular stage

Axiom
annotated source: 111-year-old human stage
annotated property: definition
annotated target: Aged stage that refers to an adult who is over 111 and under 112.
database_cross_reference: Bgee:curator

112-year-old human stage
type: Class
subclass of: human life cycle stage
subclass of: Restriction
  on property: part of
  some values from: centenarian human stage
subclass of: Restriction
  on property: immediately_preceded_by
  some values from: 111-year-old human stage
definition: Aged stage that refers to an adult who is over 112 and under 113.
end, years post birth: 113.0
start, years post birth: 112.0
has_obo_namespace: human_developmental_stage
id: HsapDv:0000253
in_subset: granular stage

Axiom
annotated source: 112-year-old human stage
annotated property: definition
annotated target: Aged stage that refers to an adult who is over 112 and under 113.
database_cross_reference: Bgee:curator

113-year-old human stage
type: Class
subclass of: human life cycle stage
subclass of: Restriction
  on property: part of
  some values from: centenarian human stage
subclass of: Restriction
  on property: immediately_preceded_by
  some values from: 112-year-old human stage
definition: Aged stage that refers to an adult who is over 113 and under 114.
end, years post birth: 114.0
start, years post birth: 113.0
has_obo_namespace: human_developmental_stage
id: HsapDv:0000254
in_subset: granular stage

Axiom
annotated source: 113-year-old human stage
annotated property: definition
annotated target: Aged stage that refers to an adult who is over 113 and under 114.
database_cross_reference: Bgee:curator

114-year-old human stage
type: Class
subclass of: human life cycle stage
subclass of: Restriction
  on property: part of
  some values from: centenarian human stage
subclass of: Restriction
  on property: immediately_preceded_by
  some values from: 113-year-old human stage
definition: Aged stage that refers to an adult who is over 114 and under 115.
end, years post birth: 115.0
start, years post birth: 114.0
has_obo_namespace: human_developmental_stage
id: HsapDv:0000255
in_subset: granular stage

Axiom
annotated source: 114-year-old human stage
annotated property: definition
annotated target: Aged stage that refers to an adult who is over 114 and under 115.
database_cross_reference: Bgee:curator

under-1-year-old human stage
type: Class
subclass of: human life cycle stage
subclass of: Restriction
  on property: part of
  some values from: infant stage
subclass of: Restriction
  on property: immediately_preceded_by
  some values from: newborn human stage
definition: Infant stage that refers to an infant who is over 31 days and is under 12 months old.
end, months post birth: 24.0
end, years post birth: 1.0
start, months post birth: 1.0
start, years post birth: 0.083
has_exact_synonym: 1-11 months
has_obo_namespace: human_developmental_stage
id: HsapDv:0000256

Axiom
annotated source: under-1-year-old human stage
annotated property: definition
annotated target: Infant stage that refers to an infant who is over 31 days and is under 12 months old.
database_cross_reference: Bgee:curator