SewerNet Ontology v1.1
type: Ontology
imports: DOLCE-Lite.owl
contributor: Franca Debole and Francesca Frontini
creator: Batoul Haydar, Nanée Chahinian and Maria Keet
description: SewerNet describes the structure and functioning of wastewater and stormwater networks and their elements. SewerNet is aligned with the DOLCE-lite foundational ontology and imports a few axioms from the Time ontology for interoperability providing a well-established semantic basis for modelling sewer networks. By adhering to INSPIRE EU directive and the RAEPA geostandard, SewerNet provides a structured framework facilitating the integration of multi-source data, enabling a unified view of information.
description: SewerNet décrit la structure des réseaux d’eaux usées et d’eaux pluviales et de leurs éléments. Elle intègre également les événements liés au processus de gestion du réseau. SewerNet est alignée sur l’ontologie fondationnelle DOLCE-Lite et importe quelques axiomes de l’ontologie Time afin d’assurer l’interopérabilité, offrant ainsi une base sémantique éprouvée pour la modélisation des réseaux d’assainissement. En se conformant à la directive européenne INSPIRE et au géostandard RAEPA, SewerNet propose un cadre structuré qui facilite l’intégration de données provenant de sources multiples et permet une vue unifiée de l’information. @fr
rights: This work is licensed under Creative Commons Attribution 4.0 International
comment: This ontology was developed as part of CROQUIS and STARWARS project funded by ANR and EU.
version info: SewerNet v1.1 includes additional annotations in English and French

assignedTo
type: ObjectProperty
domain: physical-object
range: non-physical-object
comment: Assigns network and network elements with roles

hasBearer
type: ObjectProperty
domain: non-physical-object
range: physical-object
comment: Associates conduit categories with individual conduits.

weakConnectionDownstream
type: ObjectProperty
sub property of: weak-connection
domain: physical-object
range: physical-object
comment: Connects nodes with downstream conduits

weakConnectionUpstream
type: ObjectProperty
sub property of: weak-connection
domain: physical-object
range: physical-object
comment: Connects nodes with upstream conduits

has beginning
type: ObjectProperty
sub property of: has time
domain: Temporal entity
range: Time instant
comment: Beginning of a temporal entity
comment: Comienzo de una entidad temporal. @es
label: tiene principio @es
definition: Beginning of a temporal entity.

has duration
type: ObjectProperty
sub property of: has temporal duration
range: duración de tiempo
comment: Duración de una entidad temporal, expresada como un valor escalado o un valor nominal. @es
comment: Duration of a temporal entity, expressed as a scaled value or nominal value
label: tiene duración @es
definition: Duración de una entidad temporal, evento o actividad, o cosa, expresada como un valor escalado. @es
definition: Duration of a temporal entity, event or activity, or thing, expressed as a scaled value

has duration description
type: ObjectProperty
sub property of: has temporal duration
range: Generalized duration description
comment: Duración de una entidad temporal, expresada utilizando una descripción estructurada. @es
comment: Duration of a temporal entity, expressed using a structured description
label: tiene descripción de duración @es

has end
type: ObjectProperty
sub property of: has time
domain: Temporal entity
range: Time instant
comment: End of a temporal entity.
comment: Final de una entidad temporal. @es
label: tiene fin @es

has temporal duration
type: ObjectProperty
domain: Temporal entity
range: Temporal duration
comment: Duración de una entidad temporal. @es
comment: Duration of a temporal entity.
label: tiene duración temporal @es

has time
type: ObjectProperty
range: Temporal entity
comment: Proporciona soporte a la asociación de una entidad temporal (instante o intervalo) a cualquier cosa. @es
comment: Supports the association of a temporal entity (instant or interval) to any thing
label: tiene tiempo @es
editorial note: Característica arriesgada -añadida en la revisión del 2017 que no ha sido todavía utilizada de forma amplia. @es
editorial note: Feature at risk - added in 2017 revision, and not yet widely used.

Air valve
type: Class
subclass of: Apparatus
comment: Sewer air release valve
comment: Ventouse d'assainissement @fr
label: Ventouse @fr
see also: Géostandard Réseaux d’adduction d’eau potable et d’assainissement (RAEPA) v1.2 https://www.geoinformations.developpement-durable.gouv.fr/geostandard-reseaux-d-adduction-d-eau-potable-et-d-a3674.html @fr

Apparatus
type: Class
subclass of: Node
comment: A node where equipment and its casing (such as a valve and valve box, perforation for individual connections, etc.) are positioned, either located in a structure or not (as in the case of a branch connection) Subclasses include the msot common apparatus.
comment: Nœud où est positionné un appareillage et son enveloppe (vanne et bouche à clé, percement pour branchement individuel, etc.) abrité dans un ouvrage ou non (cas de piquage) @fr
label: Appareillage @fr
label: Equipment
label: Fittings
see also: Géostandard Réseaux d’adduction d’eau potable et d’assainissement (RAEPA) v1.2 https://www.geoinformations.developpement-durable.gouv.fr/geostandard-reseaux-d-adduction-d-eau-potable-et-d-a3674.html @fr

Attribute author
type: Class
subclass of: Objet social
subclass of: Restriction
  on property: participant-in
  some values from: Geolocation
comment: Auteur de la saisie des données attributaires (lorsque différent de l'auteur de la géolocalisation) @fr
comment: The author of the attribute data acquisition (if different from the author of the geolocalisation)
label: Auteur de l'attribut @fr
see also: Géostandard Réseaux d’adduction d’eau potable et d’assainissement (RAEPA) v1.2 https://www.geoinformations.developpement-durable.gouv.fr/geostandard-reseaux-d-adduction-d-eau-potable-et-d-a3674.html @fr

Cement
type: Class
subclass of: Material
comment: Hydraulic binder used in the preparation of concrete and in the production of flooring, bricks, plasters, and limes (asbestos cement, fibre cement, fiber-cement)
comment: Liant hydraulique utilisé dans la préparation du béton et dans la confection des dallages, des parpaings, des enduits et des mortiers (Amiante-ciment, fibre ciment, fibro-ciment) @fr
label: Ciment @fr

Channel
type: Class
subclass of: Conduit
comment: An open conduit that directs flow
comment: Un canal ouvert qui dirige l'écoulement @fr
label: Canal @fr

Collection
type: Class
subclass of: Conduit function
disjoint with: Transport
comment: Canalisation de collecte @fr
comment: Conduit mainly used for collection of sewage water
label: Collecte @fr
see also: Géostandard Réseaux d’adduction d’eau potable et d’assainissement (RAEPA) v1.2 https://www.geoinformations.developpement-durable.gouv.fr/geostandard-reseaux-d-adduction-d-eau-potable-et-d-a3674.html @fr
see also: Infrastructure for Spatial Information in Europe (INSPIRE)

Combined conduit
type: Class
subclass of: Conduit category
comment: A conduit conveying wastewater and stormwater under normal operating conditions
comment: Canalisation véhiculant des eaux usées et pluviales en fonctionnement normal @fr
label: Canalisation unitaire @fr
see also: Géostandard Réseaux d’adduction d’eau potable et d’assainissement (RAEPA) v1.2 https://www.geoinformations.developpement-durable.gouv.fr/geostandard-reseaux-d-adduction-d-eau-potable-et-d-a3674.html @fr

Combined network
type: Class
subclass of: Network
comment: Réseau de collecte des eaux usées et des eaux pluviales @fr
comment: Wastewater and stormwater collection network
label: Réseau unitaire @fr
see also: Géostandard Réseaux d’adduction d’eau potable et d’assainissement (RAEPA) v1.2 https://www.geoinformations.developpement-durable.gouv.fr/geostandard-reseaux-d-adduction-d-eau-potable-et-d-a3674.html @fr

Combined wastewater
type: Class
subclass of: Sewer water
comment: A combined wastewater sewer is a type of sewer system that collects sanitary sewage and stormwater runoff in a single pipe system.
comment: Un égout unitaire d’eaux usée est un type de réseau d’assainissement qui collecte les eaux usées domestiques et les eaux de ruissellement dans une seule canalisation @fr
label: Eaux usées combinée @fr
see also: Infrastructure for Spatial Information in Europe (INSPIRE)

Concrete
type: Class
subclass of: Material
comment: Cela comprend, entre autres : le béton armé, le béton composite, le béton précontraint @fr
comment: It includes among others: reinforced concrete, composite concrete, prestressed reinforced concrete
label: Béton @fr

Conduit
type: Class
subclass of: Network element
subclass of: Restriction
  on property: generic-dependent
  some values from: Conduit function
subclass of: Restriction
  on property: has-quality
  some values from: Conduit circulation mode
subclass of: Restriction
  on property: has-quality
  some values from: Diameter
subclass of: Restriction
  on property: has-quality
  some values from: Dimension
subclass of: Restriction
  on property: has-quality
  some values from: Flow direction
subclass of: Restriction
  on property: has-quality
  some values from: Length
subclass of: Restriction
  on property: has-quality
  some values from: Shape
subclass of: Restriction
  on property: has-quality
  some values from: Slope
subclass of: Restriction
  on property: specific-constant-constituent
  some values from: Material
subclass of: Restriction
  on property: weak-connection
  some values from: Node
comment: A set of pipes joined at their ends, with identical physical characteristics (diameter, material, etc.), spatially represented by a line
comment: Ensemble de tuyaux joints par leurs extrémités, de caractéristiques physiques (diamètre, matériau, etc.) identiques, représenté spatialement par une ligne. @fr
label: Canalisation @fr
label: Tronçon de conduite @fr
see also: Géostandard Réseaux d’adduction d’eau potable et d’assainissement (RAEPA) v1.2 https://www.geoinformations.developpement-durable.gouv.fr/geostandard-reseaux-d-adduction-d-eau-potable-et-d-a3674.html @fr

Conduit category
type: Class
subclass of: non-physical-object
subclass of: Restriction
  on property: hasBearer
  some values from: Conduit
subclass of: Restriction
  on property: generically-dependent-on
  some values from: Sewer water
comment: Catégorie de la conduite selon la nature des eaux véhiculées @fr
comment: Conduit category according to the nature of the water conveyed
label: Catégorie canalisation assainissement @fr
see also: Géostandard Réseaux d’adduction d’eau potable et d’assainissement (RAEPA) v1.2 https://www.geoinformations.developpement-durable.gouv.fr/geostandard-reseaux-d-adduction-d-eau-potable-et-d-a3674.html @fr

Conduit circulation mode
type: Class
subclass of: quality
subclass of: Restriction
  on property: inherent-in
  some values from: Conduit
comment: Fluid flow regime in the conduit
comment: Régime d'écoulement du fluide dans la canalisation @fr
label: Mode Circulation @fr
see also: Géostandard de réseaux StaR-Eau https://cnig.gouv.fr/IMG/pdf/geostandard_reseaux_enterres_des_eaux_v1_0.pdf @fr

Conduit defect
type: Class
subclass of: feature
subclass of: Restriction
  on property: part-of
  some values from: Network element
subclass of: Restriction
  on property: participant-in
  some values from: Repair
comment: Type de la défaillance ayant rendu nécessaire une réparation @fr
comment: Type of defect that required repair
label: Défaillance @fr
see also: Géostandard Réseaux d’adduction d’eau potable et d’assainissement (RAEPA) v1.2 https://www.geoinformations.developpement-durable.gouv.fr/geostandard-reseaux-d-adduction-d-eau-potable-et-d-a3674.html @fr

Conduit function
type: Class
subclass of: non-physical-object
subclass of: Restriction
  on property: generically-dependent-on
  some values from: Conduit
comment: Fonction dans le réseau d'une canalisation d'assainissement collectif @fr
comment: Function of a conduit within the collective sewer network
label: Fonction canalisation assainissement @fr
see also: Géostandard Réseaux d’adduction d’eau potable et d’assainissement (RAEPA) v1.2 https://www.geoinformations.developpement-durable.gouv.fr/geostandard-reseaux-d-adduction-d-eau-potable-et-d-a3674.html @fr

Conduit point
type: Class
subclass of: Network element part
subclass of: Restriction
  on property: weak-connection
  all values from: Node
comment: A point on a conduit
comment: Un point situé sur une canalisation @fr
label: Point de conduite @fr

Connection point
type: Class
subclass of: Apparatus
comment: Branch pipe for individual connection
comment: Piquage de branchement individuel @fr
label: Point de branchement @fr
see also: Géostandard Réseaux d’adduction d’eau potable et d’assainissement (RAEPA) v1.2 https://www.geoinformations.developpement-durable.gouv.fr/geostandard-reseaux-d-adduction-d-eau-potable-et-d-a3674.html @fr

Coordinate
type: Class
subclass of: space-region
subclass of: Restriction
  on property: q-location-of
  some values from: Géométrie
comment: La position d’un point dans l’espace peut être exprimée sous forme de coordonnées cartésiennes géocentriques (utilisant un repère tridimensionnel ayant son origine au centre des masses de la Terre, comme intermédiaire lors de calculs), soit sous forme de coordonnées géographiques (sous la forme : longitude, latitude et hauteur ellipsoïdale), soit en coordonnées planes (sur une représentation cartographique en projection). @fr
comment: The position of a point in space can be expressed in the form of geocentric Cartesian coordinates (using a three-dimensional reference system with its origin at the Earth's center of mass, as an intermediate system during calculations), or in the form of geographic coordinates (in the format: longitude, latitude, and ellipsoidal height), or in planar coordinates (on a projected cartographic representation)
label: Coordonnée @fr
see also: Institut national de l'information géographique et forestière https://geodesie.ign.fr/contenu/fichiers/coordonnees.pdf @fr

Crack
type: Class
subclass of: Conduit defect
comment: Canalisation fissurée @fr
comment: Cracked conduit
label: Fissure @fr
see also: Géostandard Réseaux d’adduction d’eau potable et d’assainissement (RAEPA) v1.2 https://www.geoinformations.developpement-durable.gouv.fr/geostandard-reseaux-d-adduction-d-eau-potable-et-d-a3674.html @fr

Decommissionned
type: Class
subclass of: Utility object status
comment: L'ouvrage n'est plus utilisé et est en cours ou a fait l'object d'un arrêt definitif de service @fr
comment: The facility is no longer used and is being or has been decommissioned.
label: Arrêt définitif de service (abandon) @fr
see also: Infrastructure for Spatial Information in Europe (INSPIRE)

Defective joint
type: Class
subclass of: Conduit defect
comment: Joint défectueux @fr
label: Joint @fr
see also: Géostandard Réseaux d’adduction d’eau potable et d’assainissement (RAEPA) v1.2 https://www.geoinformations.developpement-durable.gouv.fr/geostandard-reseaux-d-adduction-d-eau-potable-et-d-a3674.html @fr

Diameter
type: Class
subclass of: physical-quality
subclass of: Restriction
  on property: inherent-in
  some values from: Conduit
subclass of: Restriction
  on property: inherent-in
  some values from: Manhole cover
label: Diametre nominal @fr

Dimension
type: Class
subclass of: physical-quality
subclass of: Restriction
  on property: inherent-in
  some values from: Conduit
comment: Dimensions d'une canalisation non circulaire @fr
comment: Dimensions of a non-circular conduit

Discharge structure
type: Class
subclass of: Structure
comment: Discharge (outlet) of wastewater or stormwater into the natural environment
comment: Rejet (exutoire) dans le milieu naturel d'eaux usées ou pluviales @fr
label: Rejet @fr
see also: Géostandard Réseaux d’adduction d’eau potable et d’assainissement (RAEPA) v1.2 https://www.geoinformations.developpement-durable.gouv.fr/geostandard-reseaux-d-adduction-d-eau-potable-et-d-a3674.html @fr

Dislocation
type: Class
subclass of: Conduit defect
comment: Dislocation of pipe(s) from the pipeline
comment: Déboîtement de tuyau(x) de la canalisation @fr
label: Déboîtement @fr
see also: Géostandard Réseaux d’adduction d’eau potable et d’assainissement (RAEPA) v1.2 https://www.geoinformations.developpement-durable.gouv.fr/geostandard-reseaux-d-adduction-d-eau-potable-et-d-a3674.html @fr

Disused
type: Class
subclass of: Utility object status
comment: L'ouvrage n'est plus utilisé, mais il n'est pas en cours ni n'a fait l'object d'un arrêt definitif de service @fr
comment: The facility is no longer used, but is not being or has not been decommissioned. @fr
label: Arrêt de service @fr
see also: Infrastructure for Spatial Information in Europe (INSPIRE)

Downstream conduit extremity
type: Class
subclass of: Conduit point
comment: Final point of a conduit (terminal point)
comment: Point final d'une canalisation (extrémité aval) @fr
label: Extrémité du conduit aval @fr

Elevation
type: Class
subclass of: spatial-location q
subclass of: Restriction
  on property: inherent-in
  some values from: Network element part
subclass of: Restriction
  on property: inherent-in
  some values from: Node
comment: L'altitude d'un point est la coordonnée par laquelle on exprime l'écart vertical de ce point à une surface de référence proche du géoïde. @fr
comment: The altitude of a point is the coordinate used to express the vertical difference between that point and a reference surface close to the geoid
label: Altitude @fr
see also: Institut national de l'information géographique et forestière https://geodesie.ign.fr/contenu/fichiers/coordonnees.pdf @fr

Flow direction
type: Class
subclass of: physical-quality
subclass of: Restriction
  on property: inherent-in
  some values from: Conduit
comment: Direction of flow in the collective sewer pipe
comment: Sens de l'écoulement dans la canalisation d'assainissement collectif @fr
label: Sens ecoulement @fr
see also: Géostandard Réseaux d’adduction d’eau potable et d’assainissement (RAEPA) v1.2 https://www.geoinformations.developpement-durable.gouv.fr/geostandard-reseaux-d-adduction-d-eau-potable-et-d-a3674.html @fr

Flowmeter
type: Class
subclass of: Apparatus
comment: Appareil de mesure des débits transités @fr
comment: Flow measurement device
label: Débitmètre @fr
see also: Géostandard Réseaux d’adduction d’eau potable et d’assainissement (RAEPA) v1.2 https://www.geoinformations.developpement-durable.gouv.fr/geostandard-reseaux-d-adduction-d-eau-potable-et-d-a3674.html @fr

Force main
type: Class
subclass of: Conduit circulation mode
comment: L'eau circule sous pression dans la canalisation grâce à un système de pompage @fr
comment: Water flows in the conduit under pressure due to a pumping system
label: Forcé @fr
see also: Géostandard Réseaux d’adduction d’eau potable et d’assainissement (RAEPA) v1.2 https://www.geoinformations.developpement-durable.gouv.fr/geostandard-reseaux-d-adduction-d-eau-potable-et-d-a3674.html @fr

Functional
type: Class
subclass of: Utility object status
comment: L'ouvrage est en service @fr
comment: The facility is functional.
label: En service @fr
see also: Infrastructure for Spatial Information in Europe (INSPIRE)

Geolocation
type: Class
subclass of: achievement
subclass of: Restriction
  on property: has-quality
  some values from: Gelocation quality
subclass of: Restriction
  on property: participant
  some values from: Attribute author
subclass of: Restriction
  on property: participant
  some values from: Network element
subclass of: Restriction
  on property: participant
  some values from: Network element part
subclass of: Restriction
  on property: has time
  some values from: Temporal entity
comment: L'action de localiser des objets @fr
comment: The act of locating objects. @fr
label: Géolocalisation @fr

Gelocation quality
type: Class
subclass of: temporal-quality
subclass of: Restriction
  on property: inherent-in
  some values from: Geolocation
comment: Accuracy class pursuant to the amended inter-ministerial Decree of 15 February 2012 Class A: Accuracy class of less than 40 cm Class B: Accuracy class greater than 40 cm and less than 1.50 m Class C: Accuracy class greater than 1.50 m
comment: Classe de précision au sens de l'arrêté interministériel du 15 février 2012 modifié Classe A : Classe de précision inférieure 40 cm Classe B : Classe de précision supérieure à 40 cm et inférieure à 1,50 m Classe C : Classe de précision supérieure à 1,50 m @fr
label: Qualité Géolocalisation @fr
see also: Géostandard Réseaux d’adduction d’eau potable et d’assainissement (RAEPA) v1.2 https://www.geoinformations.developpement-durable.gouv.fr/geostandard-reseaux-d-adduction-d-eau-potable-et-d-a3674.html @fr

Geolocation quality XY
type: Class
subclass of: Gelocation quality
comment: Planimetric geolocation quality
comment: Qualité de la géolocalisation planimétrique @fr
label: Qualité de la géolocalisation XY @fr
see also: Géostandard Réseaux d’adduction d’eau potable et d’assainissement (RAEPA) v1.2 https://www.geoinformations.developpement-durable.gouv.fr/geostandard-reseaux-d-adduction-d-eau-potable-et-d-a3674.html @fr

Geolocation quality Z
type: Class
subclass of: Gelocation quality
comment: Altimetric geolocation quality
comment: Qualité de la géolocalisation altimétrique @fr
label: Qualité de la géolocalisation Z @fr
see also: Géostandard Réseaux d’adduction d’eau potable et d’assainissement (RAEPA) v1.2 https://www.geoinformations.developpement-durable.gouv.fr/geostandard-reseaux-d-adduction-d-eau-potable-et-d-a3674.html @fr

Géométrie
type: Class
subclass of: spatial-location q
subclass of: Restriction
  on property: inherent-in
  some values from: Network element
subclass of: Restriction
  on property: inherent-in
  some values from: Network element part
subclass of: Restriction
  on property: q-location
  some values from: Coordinate
comment: Geometry of an entity in vector format (point, line or polygon)
comment: Géométrie d'une entité vectorielle sous forme de point, ligne ou polygone. @fr

Glass
type: Class
subclass of: Material
comment: Manufactured mineral substance, transparent and isotropic (fibreglass)
comment: Substance minérale fabriquée, transparente et isotrope (Fibre de verre) @fr
label: Verre @fr

Gravity
type: Class
subclass of: Conduit circulation mode
comment: L'eau s'écoule par l'effet de la pesanteur dans la canalisation en pente @fr
comment: Water flows through the sloped conduit because of gravity
label: Gravitaire @fr
see also: Géostandard Réseaux d’adduction d’eau potable et d’assainissement (RAEPA) v1.2 https://www.geoinformations.developpement-durable.gouv.fr/geostandard-reseaux-d-adduction-d-eau-potable-et-d-a3674.html @fr

Hole
type: Class
subclass of: Conduit defect
comment: Canalisation percée @fr
comment: Perforated conduit
label: Percement @fr
see also: Géostandard Réseaux d’adduction d’eau potable et d’assainissement (RAEPA) v1.2 https://www.geoinformations.developpement-durable.gouv.fr/geostandard-reseaux-d-adduction-d-eau-potable-et-d-a3674.html @fr

Incident
type: Class
subclass of: achievement
subclass of: Restriction
  on property: participant
  some values from: Network element
subclass of: Restriction
  on property: participant
  some values from: Network element part
subclass of: Restriction
  on property: has time
  some values from: Temporal entity
comment: Phenomena affecting conduits or equipment whose occurrence is not subject to human control (leak, pollution, overflow, failure)
comment: Phénomènes affectant les canalisation ou les appareillages dont le déclenchement n'est pas soumis à la volonté humaine (fuite, pollution, débordement, panne) @fr

Drain
type: Class
subclass of: Structure
comment: An opening, often located along the sidewalk or sometimes on the roadway, designed to collect runoff water and discharge it into the sewer system
comment: Ouverture souvent le long d'un trottoir mais parfois sur la chaussée destinée à recueillir les eaux de ruissellement et à les évacuer à l'égout @fr
label: Avaloir @fr
label: Gully
label: Inlet
see also: Géostandard Réseaux d’adduction d’eau potable et d’assainissement (RAEPA) v1.2 https://www.geoinformations.developpement-durable.gouv.fr/geostandard-reseaux-d-adduction-d-eau-potable-et-d-a3674.html @fr

Inspection
type: Class
subclass of: accomplishment
subclass of: Restriction
  on property: participant
  some values from: Network element
subclass of: Restriction
  on property: participant
  some values from: Network element part
subclass of: Restriction
  on property: has time
  some values from: Temporal entity
comment: Actions d'examination et de contrôle des canalisation et des appareillages @fr
comment: Examination and monitoring of conduits and equipment

Invert elevation
type: Class
subclass of: Elevation
subclass of: Restriction
  on property: inherent-in
  some values from: Manhole
comment: Cote altimetrique du point le plus bas de la structure @fr
comment: Elevation of the structure's invert
label: Cote radier @fr
see also: Géostandard de réseaux StaR-Eau https://cnig.gouv.fr/IMG/pdf/geostandard_reseaux_enterres_des_eaux_v1_0.pdf @fr

Length
type: Class
subclass of: physical-quality
subclass of: Restriction
  on property: inherent-in
  some values from: Conduit
comment: Lenght of a conduit
comment: Longueur de la canalisation @fr
label: Longueur @fr
see also: Géostandard Réseaux d’adduction d’eau potable et d’assainissement (RAEPA) v1.2 https://www.geoinformations.developpement-durable.gouv.fr/geostandard-reseaux-d-adduction-d-eau-potable-et-d-a3674.html

Longitudinal breakage
type: Class
subclass of: Conduit defect
comment: Broken conduit along its lenght
comment: Canalisation fendue sur sa longueur @fr
label: Casse longitudinale @fr
see also: Géostandard Réseaux d’adduction d’eau potable et d’assainissement (RAEPA) v1.2 https://www.geoinformations.developpement-durable.gouv.fr/geostandard-reseaux-d-adduction-d-eau-potable-et-d-a3674.html @fr

Maintenance
type: Class
subclass of: accomplishment
subclass of: Restriction
  on property: participant
  some values from: Network element
subclass of: Restriction
  on property: participant
  some values from: Network element part
subclass of: Restriction
  on property: participant
  some values from: Class
    union of: Operator
    union of: Project owner
subclass of: Restriction
  on property: has time
  some values from: Temporal entity
comment: All operations intended to maintain or restore a network element (replacement, repair, rehabilitation)
comment: Ensemble des opérations permettant de maintenir ou de rétablir un élément du réseau (remplacement, réparation, réhabilitation @fr

Manhole
type: Class
subclass of: Structure
subclass of: Restriction
  on property: has-quality
  some values from: Invert elevation
subclass of: Restriction
  on property: has-quality
  some values from: Rim elevation
comment: Puits recouvert d'une plaque au niveau du sol pour permettre un accès au réseaux d'eau urbains (regard de visite) @fr
comment: Wells covered with a slab at ground level providing access to urban water supply networks (inspection manhole)
label: Regard @fr
see also: Géostandard Réseaux d’adduction d’eau potable et d’assainissement (RAEPA) v1.2 https://www.geoinformations.developpement-durable.gouv.fr/geostandard-reseaux-d-adduction-d-eau-potable-et-d-a3674.html @fr

Manhole cover
type: Class
subclass of: Network element part
subclass of: Restriction
  on property: has-quality
  some values from: Diameter
subclass of: Restriction
  on property: specific-constant-constituent
  some values from: Material
comment: A cover placed on a manhole at ground level providing access to underground
comment: Fermeture ronde ou carrée, d'un seul tenant @fr
label: Tampon de regard @fr
see also: Géostandard de réseaux StaR-Eau https://cnig.gouv.fr/IMG/pdf/geostandard_reseaux_enterres_des_eaux_v1_0.pdf @fr

Masonry
type: Class
subclass of: Material
comment: Materials (large stones, blocks, bricks, etc.) bound together with a binder (lime, plaster, cement, etc.)
comment: Matériaux (pierres de taille, moellons, briques, etc.) unis par un liant (mortier, plâtre, ciment, etc.) @fr
label: Maçonné @fr

Material
type: Class
subclass of: amount-of-matter
subclass of: Restriction
  on property: specific-constant-constituent
  some values from: Conduit
subclass of: Restriction
  on property: specific-constant-constituent
  some values from: Manhole cover
comment: Material of the network elements
comment: Matériau des éléments réseaux @fr
is defined by: Géostandard Réseaux d’adduction d’eau potable et d’assainissement (RAEPA) v1.2 https://www.geoinformations.developpement-durable.gouv.fr/geostandard-reseaux-d-adduction-d-eau-potable-et-d-a3674.html @fr
label: Matériau @fr

Metallic
type: Class
subclass of: Material
comment: (acier, cuivre, fonte ductile, fonte grise, tôle galvanisée) @fr
comment: It includes among others: steel, galvanized steel, copper, lead, cast iron , ductile iron
label: Métal @fr

Natural stone
type: Class
subclass of: Material
comment: Building material consisting of naturally occuring mineral substance extracted from the earth (millstone, sandstone)
comment: Matériau de construction constitué de la roche d'où elle est extraite (pierre meulière, grès) @fr
label: Pierre naturelle @fr

Net breakage
type: Class
subclass of: Conduit defect
comment: Broken conduit
comment: Canalisation cassée @fr
label: Casse nette @fr
see also: Géostandard Réseaux d’adduction d’eau potable et d’assainissement (RAEPA) v1.2 https://www.geoinformations.developpement-durable.gouv.fr/geostandard-reseaux-d-adduction-d-eau-potable-et-d-a3674.html @fr

Network
type: Class
subclass of: physical-object
subclass of: Restriction
  on property: assignedTo
  some values from: Attribute author
subclass of: Restriction
  on property: assignedTo
  some values from: Operator
subclass of: Restriction
  on property: assignedTo
  some values from: Project owner
subclass of: Restriction
  on property: part
  some values from: Network element
subclass of: Restriction
  on property: part
  some values from: Network element part
subclass of: Restriction
  on property: part-of
  some values from: Network
subclass of: Restriction
  on property: participant-in
  some values from: Incident
subclass of: Restriction
  on property: participant-in
  some values from: Inspection
subclass of: Restriction
  on property: participant-in
  some values from: Maintenance
subclass of: Restriction
  on property: participant-in
  some values from: Repair
comment: Type de réseau d'assainissement collectif @fr
comment: Type of collective sewer network
label: Type réseau assainissement @fr
see also: Géostandard Réseaux d’adduction d’eau potable et d’assainissement (RAEPA) v1.2 https://www.geoinformations.developpement-durable.gouv.fr/geostandard-reseaux-d-adduction-d-eau-potable-et-d-a3674.html @fr

Network element
type: Class
subclass of: physical-object
subclass of: Restriction
  on property: assignedTo
  some values from: Attribute author
subclass of: Restriction
  on property: assignedTo
  some values from: Operator
subclass of: Restriction
  on property: assignedTo
  some values from: Project owner
subclass of: Restriction
  on property: has-quality
  some values from: Géométrie
subclass of: Restriction
  on property: part
  some values from: Network element part
subclass of: Restriction
  on property: part-of
  some values from: Network
subclass of: Restriction
  on property: participant-in
  some values from: Geolocation
subclass of: Restriction
  on property: participant-in
  some values from: Incident
subclass of: Restriction
  on property: participant-in
  some values from: Inspection
subclass of: Restriction
  on property: participant-in
  some values from: Maintenance
subclass of: Restriction
  on property: participant-in
  some values from: Repair
subclass of: Restriction
  on property: participant-in
  some values from: Utility object status
comment: Abstract base type representing an element in a network. Every element in a network provides some function that is of interest in the network.
comment: Toutes les pièces qui composent le réseau, quel que soit leur rôle ou nature (canalisation ou noeud) @fr
label: Élément de réseau @fr
see also: Infrastructure for Spatial Information in Europe (INSPIRE)

Network element part
type: Class
subclass of: physical-object
subclass of: Restriction
  on property: assignedTo
  some values from: Attribute author
subclass of: Restriction
  on property: assignedTo
  some values from: Operator
subclass of: Restriction
  on property: assignedTo
  some values from: Project owner
subclass of: Restriction
  on property: has-quality
  some values from: Elevation
subclass of: Restriction
  on property: part-of
  some values from: Network
subclass of: Restriction
  on property: part-of
  some values from: Network element
subclass of: Restriction
  on property: participant-in
  some values from: Geolocation
subclass of: Restriction
  on property: participant-in
  some values from: Incident
subclass of: Restriction
  on property: participant-in
  some values from: Inspection
subclass of: Restriction
  on property: participant-in
  some values from: Maintenance
subclass of: Restriction
  on property: participant-in
  some values from: Repair
subclass of: Restriction
  on property: participant-in
  some values from: Utility object status
comment: Parts of Conduits and Nodes
comment: Toute partie d'un élément réseau @fr
label: Partie de l'élément de réseau @fr

Node
type: Class
subclass of: Network element
subclass of: Restriction
  on property: weakConnectionDownstream
  some values from: Conduit
subclass of: Restriction
  on property: weakConnectionUpstream
  some values from: Conduit
subclass of: Restriction
  on property: has-quality
  some values from: Elevation
subclass of: Restriction
  on property: weak-connection
  some values from: Conduit
comment: A node can either represent an apparatus or a structure, where a structure may encompass one or more apparatuses
comment: Lieu de jonction de plusieurs tronçons de conduite ou de percement d'un tronçon de conduite @fr
label: Nœud @fr
see also: Géostandard Réseaux d’adduction d’eau potable et d’assainissement (RAEPA) v1.2 https://www.geoinformations.developpement-durable.gouv.fr/geostandard-reseaux-d-adduction-d-eau-potable-et-d-a3674.html @fr

Operator
type: Class
subclass of: Objet social
comment: Gestionnaire exploitant du réseau @fr
comment: Network operator
label: Exploitant @fr
see also: Géostandard Réseaux d’adduction d’eau potable et d’assainissement (RAEPA) v1.2 https://www.geoinformations.developpement-durable.gouv.fr/geostandard-reseaux-d-adduction-d-eau-potable-et-d-a3674.html @fr

Pipe
type: Class
subclass of: Conduit
comment: A closed conduit that transports flow
comment: Une conduit fermée qui trasporte un écoulement @fr
label: Tuyau @fr

Plastic
type: Class
subclass of: Material
comment: Cela comprend, entre autres: PVC, CPVC, PB, PE, PEX, PP, FRP @fr
comment: It includes among others: PVC, CPVC, PB, PE, PEX, PP, FRP
label: Plastique @fr

Project owner
type: Class
subclass of: Objet social
comment: Maître d'ouvrage du réseau @fr
comment: Network owner
label: Maitre d'ouvrage @fr
see also: Géostandard Réseaux d’adduction d’eau potable et d’assainissement (RAEPA) v1.2 https://www.geoinformations.developpement-durable.gouv.fr/geostandard-reseaux-d-adduction-d-eau-potable-et-d-a3674.html @fr

Projected
type: Class
subclass of: Utility object status
comment: L'ouvrage est en cours de conception. Les travaux de construction n'ont pas encore commencé @fr
comment: The facility is being designed. Construction has not yet started.
label: En projet @fr
see also: Infrastructure for Spatial Information in Europe (INSPIRE)

Pumping station
type: Class
subclass of: Structure
subclass of: Restriction
  on property: has-quality
  some values from: Volume
comment: Station de pompage d'eaux usées et/ou pluviales @fr
comment: Wastewater and/or stormwater pumping station
label: Station de pompage @fr
see also: Géostandard Réseaux d’adduction d’eau potable et d’assainissement (RAEPA) v1.2 https://www.geoinformations.developpement-durable.gouv.fr/geostandard-reseaux-d-adduction-d-eau-potable-et-d-a3674.html @fr

Reclaimed water
type: Class
subclass of: Sewer water
comment: L’eau de récupération, parfois appelée eau recyclée ,est une eau initialement usée qui a été traitée pour éliminer les solides et certaines impuretés, puis utilisée pour l’irrigation durable des espaces verts ou pour la recharge des nappes phréatiques @fr
comment: Reclaimed water, sometimes called recycled water, is former wastewater (sewage) that has been treated to remove solids and certain impurities, and then used in sustainable landscaping irrigation or to recharge groundwater aquifers.
label: Eau de récupération @fr
see also: Infrastructure for Spatial Information in Europe (INSPIRE)

Repair
type: Class
subclass of: achievement
subclass of: Restriction
  on property: participant
  some values from: Conduit defect
subclass of: Restriction
  on property: participant
  some values from: Network element
subclass of: Restriction
  on property: participant
  some values from: Network element part
subclass of: Restriction
  on property: participant
  some values from: Class
    union of: Operator
    union of: Project owner
subclass of: Restriction
  on property: has time
  some values from: Temporal entity
comment: Lieu d'une intervention sur le réseau effectuée suite à une défaillance dudit réseau @fr
comment: Network intervention carried out following a failure of said network
label: Réparation @fr
see also: Géostandard Réseaux d’adduction d’eau potable et d’assainissement (RAEPA) v1.2 https://www.geoinformations.developpement-durable.gouv.fr/geostandard-reseaux-d-adduction-d-eau-potable-et-d-a3674.html @fr

Detention basin
type: Class
subclass of: Structure
comment: Ouvrage de stockage d'eaux usées et/ou pluviales @fr
comment: Structure for the storage of wastewater and/or stormwater
label: Bassin de stockage @fr
label: Retention basin
see also: Géostandard Réseaux d’adduction d’eau potable et d’assainissement (RAEPA) v1.2 https://www.geoinformations.developpement-durable.gouv.fr/geostandard-reseaux-d-adduction-d-eau-potable-et-d-a3674.html @fr

Rim elevation
type: Class
subclass of: Elevation
subclass of: Restriction
  on property: inherent-in
  some values from: Manhole
comment: Cote altimétrique du dessus du tampon @fr
comment: Elevation of the manhole cover
label: Cote Tampon @fr
see also: Géostandard Réseaux d’adduction d’eau potable et d’assainissement (RAEPA) v1.2 https://www.geoinformations.developpement-durable.gouv.fr/geostandard-reseaux-d-adduction-d-eau-potable-et-d-a3674.html @fr

Sanitary wastewater
type: Class
subclass of: Sewer water
comment: Les égouts sanitaires évacuent les déchets provenant des habitations et les acheminent sous terre vers une station d’épuration @fr
comment: Sanitary sewers remove waste products from peoples' home and send them underground to a treatment plant.
label: Eaux usées @fr
see also: Infrastructure for Spatial Information in Europe (INSPIRE)

Sewer water
type: Class
subclass of: amount-of-matter
subclass of: Restriction
  on property: generic-dependent
  some values from: Conduit category
comment: Classification of sewer water types
comment: Classification of sewer water types.
label: Type d'eaux usées @fr
see also: Infrastructure for Spatial Information in Europe (INSPIRE)

Shape
type: Class
subclass of: physical-quality
subclass of: Restriction
  on property: inherent-in
  some values from: Conduit
comment: Forme de la canalisation (circulaire, rectangulaire, trapézoidale etc...) @fr
comment: Shape of the conduit (circular, rectangular, trapezoidal, etc.)
label: Forme @fr

Slope
type: Class
subclass of: physical-quality
subclass of: Restriction
  on property: inherent-in
  some values from: Conduit
comment: Pente de la canalisation @fr
comment: Slope of the conduit
label: Pente @fr

Objet social
type: Class
subclass of: non-physical-object
comment: Activité commerciale ou civile d'une société, telle que la définissent et l'expriment les statuts sociaux. @fr
comment: Commercial or civil activity of a company, as defined and stated in the articles of association
comment: Social object
see also: Larousse https://www.larousse.fr/dictionnaires/francais/objet/55366#163689 @fr

Spillway
type: Class
subclass of: Structure
comment: Ouvrage de décharge du trop-plein d'effluents d'une canalisation d'assainissement collectif vers un milieu naturel récepteur @fr
comment: Structure that discharges the overflow of effluents from a collective sewer conduit into a receiving natural environment
label: Déversoir d'orage @fr
label: Storm overflow
label: Weir
see also: Géostandard Réseaux d’adduction d’eau potable et d’assainissement (RAEPA) v1.2 https://www.geoinformations.developpement-durable.gouv.fr/geostandard-reseaux-d-adduction-d-eau-potable-et-d-a3674.html @fr

Stormwater conduit
type: Class
subclass of: Conduit category
comment: A conduit conveying stormwater
comment: Canalisation véhiculant des eaux pluviales @fr
label: Canalisation eaux pluviales @fr
see also: Géostandard Réseaux d’adduction d’eau potable et d’assainissement (RAEPA) v1.2 https://www.geoinformations.developpement-durable.gouv.fr/geostandard-reseaux-d-adduction-d-eau-potable-et-d-a3674.html @fr

Stormwater network
type: Class
subclass of: Network
comment: Collection network exclusively for stormwater
comment: Réseau de collecte de seules eaux pluviales @fr
label: Réseau pluvial @fr
see also: Géostandard Réseaux d’adduction d’eau potable et d’assainissement (RAEPA) v1.2 https://www.geoinformations.developpement-durable.gouv.fr/geostandard-reseaux-d-adduction-d-eau-potable-et-d-a3674.html @fr

Stormwater runoff
type: Class
subclass of: Sewer water
comment: Les tuyau d’évacuation d’eaux pluviales recueillent la pluie et les eaux de ruissellement et les dirigent vers des zones humides et des lacs. Les fossés et les grilles en bordure de trottoir sont des collecteurs d'eaux pluviales @fr
comment: Storm wastewater drains gather rain and storm runoff and direct them to wetlands and lakes. Ditches and curb line grates are storm drains.
label: Ruissellement pluvial @fr
see also: Infrastructure for Spatial Information in Europe (INSPIRE)

Structure
type: Class
subclass of: Node
comment: Node (interrupting or not) where a masonry structure (manhole, chamber, etc.) is located, which may or may not house one or more collective sewerage devices Subclasses include the most common structures.
comment: Nœud (coupant ou non) où est positionné un ouvrage en maçonnerie (regard, chambre, etc.) abritant ou non un ou plusieurs appareillages @fr
label: Ouvrage @fr
see also: Géostandard Réseaux d’adduction d’eau potable et d’assainissement (RAEPA) v1.2 https://www.geoinformations.developpement-durable.gouv.fr/geostandard-reseaux-d-adduction-d-eau-potable-et-d-a3674.html @fr

Transport
type: Class
subclass of: Conduit function
comment: Canalisation de transport @fr
comment: Conduit mainly used for transportation of water/electr/etc over long distances to distribution points
see also: Géostandard Réseaux d’adduction d’eau potable et d’assainissement (RAEPA) v1.2 https://www.geoinformations.developpement-durable.gouv.fr/geostandard-reseaux-d-adduction-d-eau-potable-et-d-a3674.html @fr
see also: Infrastructure for Spatial Information in Europe (INSPIRE)

Treatment plant
type: Class
subclass of: Structure
subclass of: Restriction
  on property: has-quality
  some values from: Volume
comment: Station de traitement d'eaux usées @fr
comment: Wastewater treatment plant
label: Station d'épuration @fr
see also: Géostandard Réseaux d’adduction d’eau potable et d’assainissement (RAEPA) v1.2 https://www.geoinformations.developpement-durable.gouv.fr/geostandard-reseaux-d-adduction-d-eau-potable-et-d-a3674.html @fr

Under construction
type: Class
subclass of: Utility object status
comment: L'ouvrage est en construction et pas encore en service. Cela ne s'applique qu'à la construction initiale de l'ouvrage, et non aux travaux de maintenance @fr
comment: The facility is under construction and not yet functional. This applies only to the initial construction of the facility and not to maintenance work
label: En construction @fr
see also: Infrastructure for Spatial Information in Europe (INSPIRE)

Upstream conduit extremity
type: Class
subclass of: Conduit point
comment: Point initial d'une canalisation (extrémité amont) @fr
comment: Starting point of a conduit (initial point)
label: Extrémité du conduit amont @fr

Utility object status
type: Class
subclass of: state
subclass of: Restriction
  on property: participant
  some values from: Network element
subclass of: Restriction
  on property: participant
  some values from: Network element part
comment: L'état d'un objet par rapport à son achèvement et à son utilisation @fr
comment: The status of an object with regards to its completion and use
label: Etat de service du patrimoine @fr
see also: Infrastructure for Spatial Information in Europe (INSPIRE)

Vacuum
type: Class
subclass of: Conduit circulation mode
comment: L'eau circule par l'effet de la mise sous vide de la canalisation par une centrale d'aspiration @fr
comment: Water flows due to the vacuum created in the conduit by a sunction station
label: Sous-vide @fr
see also: Géostandard Réseaux d’adduction d’eau potable et d’assainissement (RAEPA) v1.2 https://www.geoinformations.developpement-durable.gouv.fr/geostandard-reseaux-d-adduction-d-eau-potable-et-d-a3674.html @fr

Valve
type: Class
subclass of: Apparatus
comment: Sewer valve
comment: Vanne d'assainissement @fr
label: Vanne @fr
see also: Géostandard Réseaux d’adduction d’eau potable et d’assainissement (RAEPA) v1.2 https://www.geoinformations.developpement-durable.gouv.fr/geostandard-reseaux-d-adduction-d-eau-potable-et-d-a3674.html @fr

Volume
type: Class
subclass of: physical-quality
subclass of: Restriction
  on property: inherent-in
  some values from: Pumping station
subclass of: Restriction
  on property: inherent-in
  some values from: Treatment plant
comment: Volume de l'ouvrage @fr
comment: Volume of the structure

Wastewater conduit
type: Class
subclass of: Conduit category
comment: A conduit conveying wastewater
comment: Canalisation véhiculant des eaux usées @fr
label: Canalisation eaux usées @fr
see also: Géostandard Réseaux d’adduction d’eau potable et d’assainissement (RAEPA) v1.2 https://www.geoinformations.developpement-durable.gouv.fr/geostandard-reseaux-d-adduction-d-eau-potable-et-d-a3674.html @fr

Wastewater network
type: Class
subclass of: Network
comment: Réseau de collecte de seules eaux usées @fr
comment: Wastewater collection network
label: Réseau eaux usées @fr
see also: Géostandard Réseaux d’adduction d’eau potable et d’assainissement (RAEPA) v1.2 https://www.geoinformations.developpement-durable.gouv.fr/geostandard-reseaux-d-adduction-d-eau-potable-et-d-a3674.html @fr

X Coordinate
type: Class
subclass of: Coordinate
comment: Coordonnée X Lambert 93 (en mètres) @fr
comment: X coordinate in Lambert 93 (in meters)
label: Coordonnée X @fr
see also: Géostandard Réseaux d’adduction d’eau potable et d’assainissement (RAEPA) v1.2 https://www.geoinformations.developpement-durable.gouv.fr/geostandard-reseaux-d-adduction-d-eau-potable-et-d-a3674.html @fr

Y Coordinate
type: Class
subclass of: Coordinate
comment: Coordonnée Y Lambert 93 (en mètres) @fr
comment: Y coordinate in Lambert 93 (in meters)
label: Coordonnée Y @fr
see also: Géostandard Réseaux d’adduction d’eau potable et d’assainissement (RAEPA) v1.2 https://www.geoinformations.developpement-durable.gouv.fr/geostandard-reseaux-d-adduction-d-eau-potable-et-d-a3674.html @fr

Date-time interval
type: Class
subclass of: Proper interval
comment: 'intervalo de fecha-hora' es una subclase de 'intervalo propio', definida utilizando el multi-elemento 'descripción de fecha-hora'. @es
comment: DateTimeInterval is a subclass of ProperInterval, defined using the multi-element DateTimeDescription.
label: intervalo de fecha-hora @es
note: 'intervalo de fecha-hora' se puede utilizar sólo para un intervalo cuyos límites coinciden con un elemento de fecha-hora alineados con el calendario y la zona horaria indicados. Por ejemplo, aunque ambos tienen una duración de un día, el intervalo de 24 horas que empieza en la media noche del comienzo del 8 mayo en Europa Central se puede expresar como un 'intervalo de fecha-hora', el intervalo de 24 horas que empieza a las 1:30pm no. @es
note: :DateTimeInterval can only be used for an interval whose limits coincide with a date-time element aligned to the calendar and timezone indicated. For example, while both have a duration of one day, the 24-hour interval beginning at midnight at the beginning of 8 May in Central Europe can be expressed as a :DateTimeInterval, but the 24-hour interval starting at 1:30pm cannot.

duración de tiempo
type: Class
subclass of: Temporal duration
comment: Duración de una extensión temporal expresada como un número escalado por una unidad temporal. @es
comment: Duration of a temporal extent expressed as a number scaled by a temporal unit
label: Time duration
note: Alternativa a 'descripción de tiempo' para proporcionar descripción soporte a una duración temporal diferente a utilizar un sistema de calendario/reloj. @es
note: Alternative to time:DurationDescription to support description of a temporal duration other than using a calendar/clock system.

Duration description
type: Class
subclass of: Generalized duration description
comment: Descripción de extensión temporal estructurada con valores separados para los distintos elementos de un sistema de horario-calendario. El sistema de referencia temporal se fija al calendario gregoriano, y el intervalo de cada una de las propiedades numéricas se restringe a xsd:decimal. @es
comment: Description of temporal extent structured with separate values for the various elements of a calendar-clock system. The temporal reference system is fixed to Gregorian Calendar, and the range of each of the numeric properties is restricted to xsd:decimal
label: descripción de duración @es
note: En el calendario gregoriano la longitud de los meses no es fija. Por lo tanto, un valor como "2,5 meses" no se puede comparar exactamente con una duración similar expresada en términos de semanas o días. @es
note: In the Gregorian calendar the length of the month is not fixed. Therefore, a value like "2.5 months" cannot be exactly compared with a similar duration expressed in terms of weeks or days.

Generalized duration description
type: Class
subclass of: Temporal duration
comment: Descripción de extensión temporal estructurada con valores separados para los distintos elementos de un sistema de horario-calendario. @es
comment: Description of temporal extent structured with separate values for the various elements of a calendar-clock system.
label: descripción de duración generalizada @es
note: La extensión de una duración de tiempo expresada como una 'descripción de duración general' depende del Sistema de Referencia Temporal. En algunos calendarios la longitud de la semana o del mes no es constante a lo largo del año. Por tanto, un valor como "25 meses" puede no ser necesariamente ser comparado con un duración similar expresada en términos de semanas o días. Cuando se consideran calendarios que no están basados en el movimiento de la Tierra, se deben tomar incluso más precauciones en la comparación de duraciones. @es
note: The extent of a time duration expressed as a GeneralDurationDescription depends on the Temporal Reference System. In some calendars the length of the week or month is not constant within the year. Therefore, a value like "2.5 months" may not necessarily be exactly compared with a similar duration expressed in terms of weeks or days. When non-earth-based calendars are considered even more care must be taken in comparing durations.

Time instant
type: Class
subclass of: Temporal entity
disjoint with: Proper interval
comment: A temporal entity with zero extent or duration
comment: Una entidad temporal con una extensión o duración cero. @es
label: instante de tiempo. @es

Time interval
type: Class
subclass of: Temporal entity
comment: A temporal entity with an extent or duration
comment: Una entidad temporal con una extensión o duración. @es
label: intervalo de tiempo @es

Proper interval
type: Class
subclass of: Time interval
comment: A temporal entity with non-zero extent or duration, i.e. for which the value of the beginning and end are different
comment: Una entidad temporal con extensión o duración distinta de cero, es decir, para la cual los valores de principio y fin del intervalo son diferentes. @es
label: intervalo propio @es

Temporal duration
type: Class
comment: Extensión de tiempo; duración de un intervalo de tiempo independiente de su posición de inicio particular. @es
comment: Time extent; duration of a time interval separate from its particular start position
label: duración temporal @es

Temporal entity
type: Class
equivalent class: Class
  union of: Time instant
  union of: Time interval
subclass of: Thing
subclass of: Restriction
  on property: has temporal duration
  some values from: Temporal duration
comment: A temporal interval or instant.
comment: Un intervalo temporal o un instante. @es
label: entidad temporal @es

Temporal unit
type: Class
subclass of: Temporal duration
comment: A standard duration, which provides a scale factor for a time extent, or the granularity or precision for a time position.
comment: Una duración estándar, que proporciona un factor de escala para una extensión de tiempo, o la granularidad o precisión para una posición de tiempo. @es
label: unidad de tiempo @es
change note: Remove enumeration from definition, in order to allow other units to be used when required in other coordinate systems. NOTE: existing units are still present as members of the class, but the class membership is now open. In the original OWL-Time the following constraint appeared: owl:oneOf ( time:unitSecond time:unitMinute time:unitHour time:unitDay time:unitWeek time:unitMonth time:unitYear ) ;
note: La pertenencia de la clase 'unidad de tiempo' está abierta, para permitir otras unidades de tiempo utilizadas en algunas aplicaciones técnicas (por ejemplo, millones de años o el mes Baha'i). @es
note: Membership of the class TemporalUnit is open, to allow for other temporal units used in some technical applications (e.g. millions of years, Baha'i month).