OntologyApplicationSystem
type: Class
subclass of: ApplicationSystem
comment: Information System, Project, Software application.

filtering_semantic
type: Class
comment: the ontology can be used to filter irrelevant information. as for personalization.
subclass of: Restriction
  some values from: FilterRole
  on property: hasAssociatedRole
subclass of: TasksPerformedByOntologies

annotation
type: Class
subclass of: TasksPerformedByOntologies
comment: general annotation task
subclass of: Restriction
  on property: hasAssociatedRole
  some values from: VocabularyRole

OntologyRole
type: Class
subclass of: Role
comment: role of an ontology in a specific task

search_semantic
type: Class
comment: an ontology can be used to improve retrieval or search
subclass of: TasksPerformedByOntologies

OntologyType
type: Class
comment: type of ontology

isCreatedUsingMethod
type: ObjectProperty
comment: the way the ontology was conceptualized: manually, semi-automatic, fully automatic
range: Method
domain: Class
  union of: Ontology
  union of: GroupOfPrimitives
  union of: OntologicalPrimitive

mediation_semantic
type: Class
comment: an ontology can be used as mediator between applications, agents, Web Services.
subclass of: TasksPerformedByOntologies
subclass of: Restriction
  on property: hasAssociatedRole
  some values from: ModelRole

formulation_query_semantic
type: Class
comment: the ontology can be used as vocabulary for a query language.
subclass of: Restriction
  some values from: VocabularyRole
  on property: hasAssociatedRole
subclass of: TasksPerformedByOntologies

configuration_semantic
type: Class
subclass of: Restriction
  some values from: ModelRole
  on property: hasAssociatedRole
subclass of: TasksPerformedByOntologies
comment: an ontology can be used to define configuration profiles

indexing_semantic
type: Class
subclass of: TasksPerformedByOntologies
comment: an ontology can be used to index documents
subclass of: Restriction
  some values from: IndexRole
  on property: hasAssociatedRole

matching_semantic
type: Class
comment: an ontology can be used to match documents, profiles etc.
subclass of: Restriction
  on property: hasAssociatedRole
  some values from: ModelRole
subclass of: TasksPerformedByOntologies

integration_data_semantic
type: Class
comment: an ontology can be used for data or schema integration.
subclass of: Restriction
  on property: hasAssociatedRole
  some values from: ModelRole
subclass of: TasksPerformedByOntologies

personalization_semantic
type: Class
subclass of: TasksPerformedByOntologies
comment: an ontology can be used for personalized services
subclass of: Restriction
  on property: hasAssociatedRole
  some values from: Class
    union of: FilterRole
    union of: ModelRole

rewriting_query_semantic
type: Class
subclass of: Restriction
  some values from: Class
    union of: FilterRole
    union of: VocabularyRole
    union of: ModelRole
  on property: hasAssociatedRole
comment: an ontology can be used to refine or disambiguate queries
subclass of: TasksPerformedByOntologies

ABox
type: Class
comment: set of instances
subclass of: GroupOfPrimitives
subclass of: Restriction
  all values from: Instance
  on property: hasPart

describesDomain
type: ObjectProperty
comment: The domain described by an ontology or a sub-ontology. References an ontology of topics, e.g. the open directory.
range: Topic
domain: SemanticWebResource

usedInApplication
type: ObjectProperty
comment: the application or project deploying or generating the ontology.
range: ApplicationSystem
domain: SemanticWebResource

protege
type: OntologyEngineeringTool
has associated task: ontologyengineering
is created by: tooldeveloper1
has acronym: protege

racer
type: Reasoner
is created by: tooldeveloper2
is created by: tooldeveloper1
has name: Racer
has associated task: consistencychecking
has acronym: RACER
supports: consistencycheckingracer

oiled
type: OntologyEditor
is created by: tooldeveloper2
supports: ontologyengineering
has acronym: oiled
has name: oiled
supports: consistencychecking
is used for ontology: cerif
has associated task: ontologyengineering
supports: syntacticalvalidation

cerif
type: DomainOntology
has formality level: semiformal
has URI: http://www.eurocris.org/cerif/domainontology/cerif.daml#
has status: stable
has syntax: daml
has keywords: Publication
has natural language: en
locally available at: file://c:/myontologies/cerif.daml
is created using tool: oiled
has keywords: Name
has acronym: CERIF-2002
number of instances: 0
has ambiguous labels: false
describes domain from view: Academia
is created by: ontologyengineer1
describes domain: Research
number of comments: 0
number of imported ontologies: 0
has description: A domain ontology to describe research information.
has keywords: Research
has name: cerif-2002
comment: A property of euroCRIS (http://www.eurocris.org)
has readable labels: true

owlvalidator
type: Validator
is created by: tooldeveloper2
has documentation: http://phoebus.cs.man.ac.uk:9999/OWL/Validator
has acronym: OWLValidator
has name: OWL Validator
is created by: tooldeveloper3
supports: owlvalidationmethod
has associated task: syntacticalvalidation

ka2
type: DomainOntology
is implemented using language: damloil
has name: Knowldge Annotation Initiative of the Knowledge Acquisition Community
is created using tool: ontoedit
has keywords: Publication
has keywords: Science
describes domain from view: Academia
has acronym: KA2
is implemented using language: f-logic
has syntax: daml
is used for task: annotation
has natural language: en
describes domain: Research
has syntax: rdf-xml
has readable labels: true
has status: stable
has keywords: Journal
has keywords: Event
is implemented using language: owllite
has ambiguous labels: true
is created using methodology: ontoknowledge
has documentation: http://ka2portal.aifb.uni-karlsruhe.de

ontoknowledge
type: OntologyEngineeringMethodology
has associated task: ontologyengineering
is supported by tool: ontoedit
has acronym: OTKM
is created by: methoddeveloper1
has name: On-To-Knowledge-Methodology
is used for ontology: ka2

karlsruheuniversity
type: Organisation
has associated role: tooldeveloper3
has associated role: ontologyengineer4
has name: University of Karlsruhe (TH)
has acronym: UKARL

owlvalidationmethod
type: SyntacticalValidationMethod
has automatization level: automatic
has acronym: OWLValidation
is supported by tool: owlvalidator

manchesteruniversity
type: Organisation
has associated role: tooldeveloper2
has acronym: VUM
has name: University of Manchester

consistencycheckingracer
type: ConsistencyCheckingMethod
is supported by tool: racer
has automatization level: automatic
has associated task: consistencychecking
has name: Racer Consistency Checking

stanforduniversity
type: Organisation
has name: Stanford University
has associated role: tooldeveloper1

ontologyofscience
type: DomainOntology
describes domain from view: Research
has readable labels: true
has keywords: science
is created by: ontologyengineer2
has natural language: en
has formality level: informal
is implemented using language: html
has ambiguous labels: true
uses source: ka2
describes domain: Science
has keywords: research
has description: This is a slightly improved version of the KA2 ontology.

webode
type: OntologyEngineeringTool
is created by: tooldeveloper5
supports: methontology
has name: Web Ontology Design Environment
has acronym: WebODE
has associated task: ontologyengineering
has documentation: http://webode.dia.fi.upm.es/WebODEWeb/index.html

methontology
type: OntologyEngineeringMethodology
is created by: methoddeveloper2
is supported by tool: webode
has acronym: METHONTOLOGY
has name: Methontology Engineering Methodology

universityofmadrid
type: Organisation
has associated role: methoddeveloper2
has name: Universidad Politecnica de Madrid
has acronym: UPM

countrycontactorganization
type: CoreOntology
has keywords: phone number
has readable labels: true
has description: This ontology describes country contact information.
has formality level: formal
number of instances: 3
number of classes: 35
has natural language: en
is implemented using language: owldl
number of imported ontologies: 4
has status: stable
has ambiguous labels: true
has URI: http://orlando.drc.com/SemanticWeb/OWL/Ontology/Contact/ver/1.0.0/Contact-ont.owl#
has acronym: CCO
is created by: ontologyengineer3
describes domain from view: Organizations
has version number: 1.0
describes domain: Countries
has keywords: country
locally available at: file://c:/myontologies/Contact-ont.owl
number of properties: 47
has syntax: rdf-xml
has name: Country Contact Organization

aktreferenceontology
type: ApplicationOntology
has creation date: 2003-02-10
has formality level: semiformal
used in application: AKTPortal
has acronym: AKTREF
describes domain: Academic Departments
is used for task: queryRewriting
has associated role: filterrole
has description: AKT Reference Ontology (Portal Ontology)
is used for task: queryFormulation
has documentation: http://d3e.open.ac.uk/akt/2002/ref-onto.html
has name: AKT Reference Ontology
number of imported ontologies: 1
is implemented using language: owldl
has associated role: indexrole
describes domain from view: Organizations and Institutions
has syntax: rdf-xml
has status: stable
is used for task: configuration
is used for task: search
has ambiguous labels: true

umlssn
type: CoreOntology
used in application: swpatho
is created by: ontologyengineer5
has name: UMLS Semantic Network
has natural language: en
has status: release
has formality level: semiformal
ratio of correct statements: 100.0
has URI: http://swpatho.ag-nbi.de/umlssn.owl
number of imported ontologies: 0
is used for task: queryRewriting
describes domain: Medicine and Health
has acronym: UMLSSN
is used for task: search
has readable labels: true
has ambiguous labels: true
is used for task: queryFormulation
describes domain from view: Healthcare
number of comments: 260
ratio of inconsistent statements: 0.0

swpatho1
type: ApplicationOntology
is used for task: queryFormulation
is used for task: annotation
is created using tool: protege
has name: Semantic Web for Pathology
has ambiguous labels: true
number of imported ontologies: 1
has status: beta
describes domain: Medicine and Health
used in application: swpatho
uses source: umlssn
is used for task: queryRewriting
has documentation: http://swpatho.ag-nbi.de
has acronym: SWPATHO
is created by: ontologyengineer5
has readable labels: true
is created using methodology: methontology
is used for task: search
has natural language: en
has formality level: formal
describes domain from view: Healthcare

swpatho2
type: ApplicationOntology
is created using methodology: methontology
ratio of inconsistent statements: 0.0
used in application: swpatho
has ambiguous labels: true
is implemented using language: owldl
has status: release
has associated role: indexrole
has readable labels: true
is used for task: queryFormulation
describes domain: Medicine
has URI: http://swpatho.ag-nbi.de/swpatho2.owl
has syntax: rdf-xml
has documentation: http://swpatho.ag-nbi.de
number of imported ontologies: 1
ratio of correct statements: 100.0
is created by: ontologyengineer5
has formality level: formal
has acronym: SWPATHO
uses source: umlssn
has name: Semantic Web for Pathology
is used for task: annotation
has associated role: filterrole
has keywords: lung, pathology, diseases
is used for task: search
is created using tool: protege
describes domain from view: Healthcare
is previous version of: swpatho1
has natural language: de
is used for task: matching
has associated role: modelrole
number of instances: 0

freeuniversityofberlin
type: Organisation
has associated role: ontologyengineer5
has acronym: FUBerlin
has name: Free University of Berlin
has contact information: http://www.ag-nbi.de

pellet
type: Reasoner
has associated task: consistencychecking
has name: Pellet
has documentation: http://www.mindswap.org/2003/pellet/
has acronym: PELLET
is created by: tooldeveloper4
supports: consistencycheckingpellet

universityofmaryland
type: Organisation
has associated role: tooldeveloper4
has name: University of Maryland
has acronym: Mindswap
has contact information: http://www.mindswap.org/

consistencycheckingpellet
type: ConsistencyCheckingMethod
has associated task: consistencychecking
is supported by tool: pellet
has name: Pellet Consistency Checking
has automatization level: automatic

fredfreitas
type: Person
has associated role: ontologyengineer2
has name: Fred Freitas

fuberlinpersonen
type: ApplicationOntology
has readable labels: true
has formality level: formal
number of imported ontologies: 2
has keywords: Person
has ambiguous labels: false
has keywords: Arbeitsgruppe
has natural language: de
describes domain: Academia
is implemented using language: rdfs
describes domain from view: Human Resources
has description: Personen am Institut fuer Informatik
used in application: semanticwebprojectfuberlin

North American Industry Classification System
type: Classification
number of axioms: 0
has type: core
locally available at: file://c:/myontologies/naics.owl
number of imported ontologies: 0
number of classes: 1179
has description: NAICS is the first economic classification system to be constructed based on a single economic concept. Economic units that use like processes to produce goods or services are grouped together. This "production-oriented" system means that statistical agencies in the United States will produce data that can be used for measuring productivity, unit labor costs, and the capital intensity of production; constructing input-output relationships; and estimating employment-output relationships and other such statistics that require that inputs and outputs be used together. It also provides for comparable statistics with Canada and Mexico. It has replaced the U.S. Standard Industrial Classification (SIC) system.
ratio of inconsistent statements: 0.0
number of inheritance levels: 5
has type: taxonomy
has ambiguous labels: true
number of properties: 1
has acronym: NAICS
has documentation: http://www.census.gov/epcd/www/naics.html
number of instances: 0
number of comments: 0
ratio of correct statements: 1.0

fuberlin
type: ApplicationOntology
describes domain: Academia
describes domain from view: Student
has ambiguous labels: false
used in application: semanticwebprojectfuberlin
has associated role: modelrole
has keywords: Arbeitsgruppe
has readable labels: true
has syntax: rdf-xml
has formality level: formal
has keywords: Organisation
has description: Beschreibung des Instituts fuer Informatik der Freien Universitaet Berlin
is implemented using language: rdfs
has natural language: de
is used for task: search