coparticipation.owl
type: Ontology
version info: 1.1 added rdfs:isDefinedBy for all named entities 2.0 used OWL2 property chain, added defining axiom for Event having at least 2 participants
version info: Created with TopBraid Composer
comment: The co-participation pattern. This pattern re-uses the participation pattern and is extracted from DOLCE-UltraLite by partial clone of elements. This minimal pattern is useful to abstract from specific or domain-oriented 'thematic role' relations, such as 'agent', 'patient', 'instrument', 'product', 'provides', 'activator', etc. A property chain allows to derive coparticipation from simple participation relations. For a more complete version of this pattern, see the functionalsituation.owl pattern.
imports: participation.owl
imports: cpannotationschema.owl

coparticipates with
type: ObjectProperty
type: SymmetricProperty
domain: Object
range: Object
property chain axiom: isParticipantIn
property chain axiom: hasParticipant

Event
equivalent class: Restriction
  on property: hasParticipant
  on class: Object
  min qualified cardinality: 2