descriptionandsituation.owl
type: Ontology
version info: 1.1 added rdfs:isDefinedBy for all named entities
version info: Created by Valentina Presutti
comment: The Description and Situation content ontology design pattern. This CP represents conceptualizations i.e., descriptions, and corresponding groundings i.e., situations. The pattern is extracted from DOLCE+DnS Ultralite by partial cloning of elements, and is composed of three other CPs: description, situation, and classification.
has component: http://www.ontologydesignpatterns.org/cp/owl/classification.owl
has component: http://www.ontologydesignpatterns.org/cp/owl/description.owl
has component: http://www.ontologydesignpatterns.org/cp/owl/situation.owl
extracted from: http://www.ontologydesignpatterns.org/ont/dul/DUL.owl
imports: classification.owl
imports: description.owl
imports: situation.owl
imports: cpannotationschema.owl

describes
type: ObjectProperty
label: descrive @it
comment: The relation between a Description and an Entity : a Description gives a unity to a Collection of parts (the components), or constituents, by assigning a Role to each of them in the context of a whole Object (the system). A same Entity can be given different descriptions, for example, an old cradle can be given a unifying Description based on the original aesthetic design, the functionality it was built for, or a new aesthetic functionality in which it can be used as a flower pot.
domain: Description
range: Thing

is described by
type: ObjectProperty
label: è descritto da @it
comment: The relation between any Thing and a Description: a Description gives a unity to a Collection of parts (the components), or constituents, by assigning a Role to each of them in the context of a whole Object (the system). A same Thing can be given different descriptions, for example, an old cradle can be given a unifying Description based on the original aesthetic design, the functionality it was built for, or a new aesthetic functionality in which it can be used as a flower pot.
range: Description
inverse of: describes
domain: Thing

is satisfied by
type: ObjectProperty
label: è soddisfatta da @it
comment: A relation between a Situation and a Description, e.g. the execution of a Plan satisfies that plan.
domain: Description
range: Situation

satisfies
type: ObjectProperty
label: soddisfa @it
comment: A relation between a Situation and a Description, e.g. the execution of a Plan satisfies that plan.
range: Description
inverse of: is satisfied by
domain: Situation

Concept
type: Class
equivalent class: Concept
subclass of: Restriction
  on property: isDefinedIn
  min cardinality: 1

Situation
type: Class
subclass of: Restriction
  on property: satisfies
  min cardinality: 1