own2dul.owl
type: Ontology
version info: Created with TopBraid Composer
imports: schema

instance synset
type: Class
subclass of: Synset
comment: A synset that has an instanceOf relation to another synset (some of them are instanceOf other instance synsets, so creating spurious transitive chains of instanceOf (this looks like an error in WordNet, and measures have been taken to fix this in OWN).

top mapping synset
type: Class
subclass of: Synset
comment: A most general synset that has a direct mapping to a DUL class (currently such synsets are 859).

has proximal hypernym
type: ObjectProperty
domain: Synset
range: Synset
comment: A shortcut property between a WordNet synset and its proximal hypernym.

has D0+DUL top
type: ObjectProperty
domain: Class
range: Class
comment: A mapping property between a DUL class and a either a D0 or DUL top class.

has maximal hypernym
type: ObjectProperty
domain: Synset
range: top mapping synset
comment: A shortcut property between a WordNet concept synset and its maximal hypernym that has been aligned to DUL.

has d0+dul top mapping
type: ObjectProperty
domain: Synset
range: Class
comment: A mapping property between a WordNet synset and a D0+DUL class.

has dul mapping
type: ObjectProperty
domain: Synset
range: Class
comment: A mapping property between a WordNet synset and a DUL class.

instance has proximal hypernym
type: ObjectProperty
comment: A shortcut property between a WordNet instance synset and its proximal concept hypernym.
range: Synset
domain: Synset

instance has maximal hypernym
type: ObjectProperty
range: top mapping synset
domain: instance synset
comment: A shortcut property between a WordNet instance synset and its maximal hypernym that has been aligned to DUL.